BDBM7672 4-[(4-{imidazo[1,2-a]pyridazin-3-yl}pyrimidin-2-yl)amino]-N-methylbenzene-1-sulfonamide::CHEMBL520003::Imidazo[1,2-b]pyridazine deriv. 2b
SMILES: CNS(=O)(=O)c1ccc(Nc2nccc(n2)-c2cnc3cccnn23)cc1
InChI Key: InChIKey=FOJLLPFLWQTXFD-UHFFFAOYSA-N
Data: 2 IC50
PDB links: 1 PDB ID contains this monomer as substructures. 1 PDB ID contains inhibitors having a similarity of 90% to this monomer.
Activity Spreadsheet -- Enzyme Inhibition Constant Data from BindingDB
Found 2 hits for monomerid = 7672
Trg + Lig
Ki
nM
ΔG°
kcal/mole
IC50
nM
Kd
nM
EC50/IC50
nM
koff
s-1
kon
M-1s-1
pHTemp
°C
Cyclin-dependent kinase 2
(Homo sapiens (Human))
BDBM7672
(4-[(4-{imidazo[1,2-a]pyridazin-3-yl}pyrimidin-2-yl...)
Show SMILES CNS(=O)(=O)c1ccc(Nc2nccc(n2)-c2cnc3cccnn23)cc1
Show InChI InChI=1S/C17H15N7O2S/c1-18-27(25,26)13-6-4-12(5-7-13)22-17-19-10-8-14(23-17)15-11-20-16-3-2-9-21-24(15)16/h2-11,18H,1H3,(H,19,22,23)
NCI pathway
Reactome pathway
n/an/a<3n/an/an/an/an/an/a
AstraZeneca
Curated by ChEMBL
Assay Description
Inhibition of CDK2
Bioorg Med Chem Lett 18: 5487-92 (2008)
Article DOI: 10.1016/j.bmcl.2008.09.024
BindingDB Entry DOI: 10.7270/Q2J9667K
3D
3D Structure (docked)
CDK2/CycE
(Homo sapiens (Human))
BDBM7672
(4-[(4-{imidazo[1,2-a]pyridazin-3-yl}pyrimidin-2-yl...)
Show SMILES CNS(=O)(=O)c1ccc(Nc2nccc(n2)-c2cnc3cccnn23)cc1
Show InChI InChI=1S/C17H15N7O2S/c1-18-27(25,26)13-6-4-12(5-7-13)22-17-19-10-8-14(23-17)15-11-20-16-3-2-9-21-24(15)16/h2-11,18H,1H3,(H,19,22,23)
n/an/a<3n/an/an/an/a7.022
AstraZeneca
Assay Description
The kinase activity was assayed using an in vitro scintillation proximity assay (SPA) for measuring incorporation of [gamma-33P] ATP into GST-Rb.
Bioorg Med Chem Lett 14: 2249-52 (2004)
Article DOI: 10.1016/j.bmcl.2004.02.008
BindingDB Entry DOI: 10.7270/Q2XG9PCF