BDBM7675 Imidazo[1,2-b]pyridazine deriv. 2e::N-[3-(dimethylamino)propyl]-4-[(4-{imidazo[1,2-a]pyridazin-3-yl}pyrimidin-2-yl)amino]benzene-1-sulfonamide
SMILES: CN(C)CCCNS(=O)(=O)c1ccc(Nc2nccc(n2)-c2cnc3cccnn23)cc1
InChI Key: InChIKey=BBZUBCUIVIEBCP-UHFFFAOYSA-N
Data: 1 IC50
PDB links: 1 PDB ID matches this monomer.
Activity Spreadsheet -- Enzyme Inhibition Constant Data from BindingDB
Found 1 hit for monomerid = 7675
Trg + Lig
Ki
nM
ΔG°
kcal/mole
IC50
nM
Kd
nM
EC50/IC50
nM
koff
s-1
kon
M-1s-1
pHTemp
°C
CDK2/CycE
(Homo sapiens (Human))
BDBM7675
(Imidazo[1,2-b]pyridazine deriv. 2e | N-[3-(dimethy...)
Show SMILES CN(C)CCCNS(=O)(=O)c1ccc(Nc2nccc(n2)-c2cnc3cccnn23)cc1
Show InChI InChI=1S/C21H24N8O2S/c1-28(2)14-4-12-25-32(30,31)17-8-6-16(7-9-17)26-21-22-13-10-18(27-21)19-15-23-20-5-3-11-24-29(19)20/h3,5-11,13,15,25H,4,12,14H2,1-2H3,(H,22,26,27)
n/an/a<3n/an/an/an/a7.022
AstraZeneca
Assay Description
The kinase activity was assayed using an in vitro scintillation proximity assay (SPA) for measuring incorporation of [gamma-33P] ATP into GST-Rb.
Bioorg Med Chem Lett 14: 2249-52 (2004)
Article DOI: 10.1016/j.bmcl.2004.02.008
BindingDB Entry DOI: 10.7270/Q2XG9PCF
3D
3D Structure (crystal)