BDBM77083 US10093697, 12.::US10487111, Example 12.::US9694018, 12
SMILES: CCCCC1(CCCC)CN(c2ccccc2)c2cc(SC)c(OCC(=O)N[C@@H](C(=O)N[C@@H](C)C(O)=O)c3ccc(O)cc3)cc2S(=O)(=O)N1
InChI Key: InChIKey=LRMSUSCIZQUFOX-CAQRMWTPSA-N
Data: 3 IC50
Activity Spreadsheet -- Enzyme Inhibition Constant Data from BindingDB
Found 3 hits for monomerid = 77083
Trg + Lig
Ki
nM
ΔG°
kcal/mole
IC50
nM
Kd
nM
EC50/IC50
nM
koff
s-1
kon
M-1s-1
pHTemp
°C
Bile acid receptor
(Homo sapiens (Human))
BDBM77083
(US10093697, 12. | US10487111, Example 12. | US9694...)
Show SMILES CCCCC1(CCCC)CN(c2ccccc2)c2cc(SC)c(OCC(=O)N[C@@H](C(=O)N[C@@H](C)C(O)=O)c3ccc(O)cc3)cc2S(=O)(=O)N1 |r,$;;;;;;;;;;;;;;;;;;;;;;;;;;;;;;;HN;;;;;;;;;;;;;;;;;;HN$|
Show InChI InChI=1S/C36H46N4O8S2/c1-5-7-18-36(19-8-6-2)23-40(26-12-10-9-11-13-26)28-20-30(49-4)29(21-31(28)50(46,47)39-36)48-22-32(42)38-33(25-14-16-27(41)17-15-25)34(43)37-24(3)35(44)45/h9-17,20-21,24,33,39,41H,5-8,18-19,22-23H2,1-4H3,(H,37,43)(H,38,42)(H,44,45)/t24-,33+/m0/s1
NCI pathway
Reactome pathway
US Patent
n/an/a 0.300n/an/an/an/an/an/a
Albireo AB
US Patent
Assay Description
ISBT Hu HEK Uptake SPA 13203 IBAT HUM Ileal Bile Acid Transporter Human HEK Glycocholic acid Uptake Radiometric¿SPA Inhibitor IC50 Mean IC50 (nM) was...
US Patent US9694018 (2017)
BindingDB Entry DOI: 10.7270/Q2GM85GJ
Ileal bile acid transporter/bile acid cotransporter
(Homo sapiens (Human))
BDBM77083
(US10093697, 12. | US10487111, Example 12. | US9694...)
Show SMILES CCCCC1(CCCC)CN(c2ccccc2)c2cc(SC)c(OCC(=O)N[C@@H](C(=O)N[C@@H](C)C(O)=O)c3ccc(O)cc3)cc2S(=O)(=O)N1 |r,$;;;;;;;;;;;;;;;;;;;;;;;;;;;;;;;HN;;;;;;;;;;;;;;;;;;HN$|
Show InChI InChI=1S/C36H46N4O8S2/c1-5-7-18-36(19-8-6-2)23-40(26-12-10-9-11-13-26)28-20-30(49-4)29(21-31(28)50(46,47)39-36)48-22-32(42)38-33(25-14-16-27(41)17-15-25)34(43)37-24(3)35(44)45/h9-17,20-21,24,33,39,41H,5-8,18-19,22-23H2,1-4H3,(H,37,43)(H,38,42)(H,44,45)/t24-,33+/m0/s1
US Patent
n/an/a 0.300n/an/an/an/an/an/a
Albireo AB
US Patent
Assay Description
ISBT Hu HEK Uptake SPA 13203 IBAT HUM Ileal Bile Acid Transporter Human HEK Glycocholic acid Uptake Radiometric—SPA Inhibitor IC50 Mean IC50 (nM) was...
US Patent US10487111 (2019)
BindingDB Entry DOI: 10.7270/Q2542R0D
Ileal bile acid transporter/bile acid cotransporter
(Homo sapiens (Human))
BDBM77083
(US10093697, 12. | US10487111, Example 12. | US9694...)
Show SMILES CCCCC1(CCCC)CN(c2ccccc2)c2cc(SC)c(OCC(=O)N[C@@H](C(=O)N[C@@H](C)C(O)=O)c3ccc(O)cc3)cc2S(=O)(=O)N1 |r,$;;;;;;;;;;;;;;;;;;;;;;;;;;;;;;;HN;;;;;;;;;;;;;;;;;;HN$|
Show InChI InChI=1S/C36H46N4O8S2/c1-5-7-18-36(19-8-6-2)23-40(26-12-10-9-11-13-26)28-20-30(49-4)29(21-31(28)50(46,47)39-36)48-22-32(42)38-33(25-14-16-27(41)17-15-25)34(43)37-24(3)35(44)45/h9-17,20-21,24,33,39,41H,5-8,18-19,22-23H2,1-4H3,(H,37,43)(H,38,42)(H,44,45)/t24-,33+/m0/s1
US Patent
n/an/a 0.300n/an/an/an/an/an/a
TBA
US Patent
Assay Description
ISBT Hu HEK Uptake SPA 13203 IBAT HUM Ileal Bile Acid Transporter Human HEK Glycocholic acid Uptake Radiometric SPA Inhibitor IC50 Mean IC50 (nM) was...
US Patent US10093697 (2018)
BindingDB Entry DOI: 10.7270/Q2N018KT