BDBM77141 CMX157 ion
SMILES: CCCCCCCCCCCCCCCCOCCCOP([O-])(=O)CO[C@H](C)Cn1cnc2c(N)ncnc12
InChI Key: InChIKey=SCTJKHUUZLXJIP-RUZDIDTESA-M
Data: 1 EC50
Activity Spreadsheet -- Enzyme Inhibition Constant Data from BindingDB
Found 1 hit for monomerid = 77141
Trg + Lig
Ki
nM
ΔG°
kcal/mole
IC50
nM
Kd
nM
EC50/IC50
nM
koff
s-1
kon
M-1s-1
pHTemp
°C
HIV-1 B HXB2-LAI-IIIB-BRU
(Human immunodeficiency virus type 1 group M subtyp...)
BDBM77141
(CMX157 ion)
Show SMILES CCCCCCCCCCCCCCCCOCCCOP([O-])(=O)CO[C@H](C)Cn1cnc2c(N)ncnc12 |r|
Show InChI InChI=1S/C28H52N5O5P/c1-3-4-5-6-7-8-9-10-11-12-13-14-15-16-18-36-19-17-20-38-39(34,35)24-37-25(2)21-33-23-32-26-27(29)30-22-31-28(26)33/h22-23,25H,3-21,24H2,1-2H3,(H,34,35)(H2,29,30,31)/p-1/t25-/m1/s1
US Patent
n/an/an/an/a<30n/an/an/an/a
Chimerix, Inc.
US Patent
Assay Description
The in vitro antiviral activity profile for CMX157 was evaluated for cell-type effects and HIV strain effects. It is active against all major subtype...
US Patent US9694024 (2017)
BindingDB Entry DOI: 10.7270/Q2BV7DRT