BDBM7764 4-({[(3Z)-2-oxo-2,3-dihydro-1H-indol-3-ylidene]methyl}amino)-N-(1,3-thiazol-2-yl)benzene-1-sulfonamide::4-{[(2-Oxo-1,2-dihydro-3H-indol-3-ylidene)methyl]amino}-N-(1,3-thiazol-2-yl)benzenesulfonamide::Oxindole-Based Inhibitor 100
SMILES: O=C1Nc2ccccc2C1C=Nc1ccc(cc1)S(=O)(=O)Nc1nccs1
InChI Key: InChIKey=FMWOSOQYOAWCGC-UHFFFAOYSA-N
Data: 2 IC50
PDB links: 1 PDB ID matches this monomer.
Activity Spreadsheet -- Enzyme Inhibition Constant Data from BindingDB
Found 2 hits for monomerid = 7764
Trg + Lig
Ki
nM
ΔG°
kcal/mole
IC50
nM
Kd
nM
EC50/IC50
nM
koff
s-1
kon
M-1s-1
pHTemp
°C
Cyclin-Dependent Kinase 2 (CDK2)
(Homo sapiens (Human))
BDBM7764
(4-({[(3Z)-2-oxo-2,3-dihydro-1H-indol-3-ylidene]met...)
Show SMILES O=C1Nc2ccccc2C1C=Nc1ccc(cc1)S(=O)(=O)Nc1nccs1 |w:10.11|
Show InChI InChI=1S/C18H14N4O3S2/c23-17-15(14-3-1-2-4-16(14)21-17)11-20-12-5-7-13(8-6-12)27(24,25)22-18-19-9-10-26-18/h1-11,15H,(H,19,22)(H,21,23)
NCI pathway
Reactome pathway
n/an/a 1.00E+3n/an/an/an/an/an/a
GlaxoSmithKline
Assay Description
The biochemical activity of compounds was determined by incubation with specific enzymes and substrates in the presence 1.4 uM ATP/[gamma-32P] ATP. A...
J Med Chem 44: 4339-58 (2001)
Article DOI: 10.1021/jm010117d
BindingDB Entry DOI: 10.7270/Q2ST7N10
3D
3D Structure (crystal)
Cyclin-Dependent Kinase 1 (CDK1)
(Homo sapiens (Human))
BDBM7764
(4-({[(3Z)-2-oxo-2,3-dihydro-1H-indol-3-ylidene]met...)
Show SMILES O=C1Nc2ccccc2C1C=Nc1ccc(cc1)S(=O)(=O)Nc1nccs1 |w:10.11|
Show InChI InChI=1S/C18H14N4O3S2/c23-17-15(14-3-1-2-4-16(14)21-17)11-20-12-5-7-13(8-6-12)27(24,25)22-18-19-9-10-26-18/h1-11,15H,(H,19,22)(H,21,23)
Reactome pathway
n/an/a 3.80E+3n/an/an/an/an/an/a
GlaxoSmithKline
Assay Description
The biochemical activity of compounds was determined by incubation with specific enzymes and substrates in the presence 1.4 uM ATP/[gamma-32P] ATP. A...
J Med Chem 44: 4339-58 (2001)
Article DOI: 10.1021/jm010117d
BindingDB Entry DOI: 10.7270/Q2ST7N10