BDBM7840 RIVAROXABAN::US8822458, 44::US8822458, 97
SMILES: Clc1ccc(s1)C(=O)NC[C@H]1CN(C(=O)O1)c1ccc(cc1)N1CCOCC1=O
InChI Key: InChIKey=KGFYHTZWPPHNLQ-AWEZNQCLSA-N
Data: 7 KI  17 IC50
PDB links: 2 PDB IDs match this monomer.
Activity Spreadsheet -- Enzyme Inhibition Constant Data from BindingDB
Found 24 hits for monomerid = 7840
Trg + Lig
Ki
nM
ΔG°
kcal/mole
IC50
nM
Kd
nM
EC50/IC50
nM
koff
s-1
kon
M-1s-1
pHTemp
°C
Coagulation factor X
(Homo sapiens (Human))
BDBM7840
(RIVAROXABAN | US8822458, 44 | US8822458, 97)
Show SMILES Clc1ccc(s1)C(=O)NC[C@H]1CN(C(=O)O1)c1ccc(cc1)N1CCOCC1=O |r|
Show InChI InChI=1S/C19H18ClN3O5S/c20-16-6-5-15(29-16)18(25)21-9-14-10-23(19(26)28-14)13-3-1-12(2-4-13)22-7-8-27-11-17(22)24/h1-6,14H,7-11H2,(H,21,25)/t14-/m0/s1
Reactome pathway
0.400n/an/an/an/an/an/an/an/a
University of Nottingham
Curated by ChEMBL
Assay Description
Inhibition of human factor 10a using pefachrome F10a as substrate preincubated for 10 mins followed by substrate addition and measured for 20 mins
J Med Chem 61: 3799-3822 (2018)
Article DOI: 10.1021/acs.jmedchem.7b00772
BindingDB Entry DOI: 10.7270/Q2C2502H
3D
3D Structure (crystal)
Coagulation factor X
(Homo sapiens (Human))
BDBM7840
(RIVAROXABAN | US8822458, 44 | US8822458, 97)
Show SMILES Clc1ccc(s1)C(=O)NC[C@H]1CN(C(=O)O1)c1ccc(cc1)N1CCOCC1=O |r|
Show InChI InChI=1S/C19H18ClN3O5S/c20-16-6-5-15(29-16)18(25)21-9-14-10-23(19(26)28-14)13-3-1-12(2-4-13)22-7-8-27-11-17(22)24/h1-6,14H,7-11H2,(H,21,25)/t14-/m0/s1
Reactome pathway
0.400n/an/an/an/an/an/an/an/a
Sanofi-Aventis R&D
Curated by ChEMBL
Assay Description
Inhibition of factor-10a (unknown origin)
J Med Chem 56: 9441-56 (2014)
Article DOI: 10.1021/jm4005835
BindingDB Entry DOI: 10.7270/Q20K2B0C
3D
3D Structure (crystal)
Coagulation factor X
(Homo sapiens (Human))
BDBM7840
(RIVAROXABAN | US8822458, 44 | US8822458, 97)
Show SMILES Clc1ccc(s1)C(=O)NC[C@H]1CN(C(=O)O1)c1ccc(cc1)N1CCOCC1=O |r|
Show InChI InChI=1S/C19H18ClN3O5S/c20-16-6-5-15(29-16)18(25)21-9-14-10-23(19(26)28-14)13-3-1-12(2-4-13)22-7-8-27-11-17(22)24/h1-6,14H,7-11H2,(H,21,25)/t14-/m0/s1
Reactome pathway
0.400n/an/an/an/an/an/an/an/a
Millennium Pharmaceuticals, Inc
Curated by ChEMBL
Assay Description
Inhibition of Factor 10a (unknown origin)
Bioorg Med Chem Lett 19: 2179-85 (2009)
Article DOI: 10.1016/j.bmcl.2009.02.111
BindingDB Entry DOI: 10.7270/Q22Z15F5
3D
3D Structure (crystal)
Coagulation factor X
(Homo sapiens (Human))
BDBM7840
(RIVAROXABAN | US8822458, 44 | US8822458, 97)
Show SMILES Clc1ccc(s1)C(=O)NC[C@H]1CN(C(=O)O1)c1ccc(cc1)N1CCOCC1=O |r|
Show InChI InChI=1S/C19H18ClN3O5S/c20-16-6-5-15(29-16)18(25)21-9-14-10-23(19(26)28-14)13-3-1-12(2-4-13)22-7-8-27-11-17(22)24/h1-6,14H,7-11H2,(H,21,25)/t14-/m0/s1
Reactome pathway
0.400n/an/an/an/an/an/an/an/a
Bristol-Myers Squibb Company
Curated by ChEMBL
Assay Description
Inhibition of factor 10a
J Med Chem 53: 6243-74 (2010)
Article DOI: 10.1021/jm100146h
BindingDB Entry DOI: 10.7270/Q2CR5VBB
3D
3D Structure (crystal)
Coagulation factor X
(Homo sapiens (Human))
BDBM7840
(RIVAROXABAN | US8822458, 44 | US8822458, 97)
Show SMILES Clc1ccc(s1)C(=O)NC[C@H]1CN(C(=O)O1)c1ccc(cc1)N1CCOCC1=O |r|
Show InChI InChI=1S/C19H18ClN3O5S/c20-16-6-5-15(29-16)18(25)21-9-14-10-23(19(26)28-14)13-3-1-12(2-4-13)22-7-8-27-11-17(22)24/h1-6,14H,7-11H2,(H,21,25)/t14-/m0/s1
Reactome pathway
0.660n/an/an/an/an/an/an/an/a
University of Ljubljana
Curated by ChEMBL
Assay Description
Inhibition of F10a (unknown origin) using S-2222 as substrate incubated for 15 mins prior to substrate addition measured every 10 secs by spectrophot...
Eur J Med Chem 64: 302-13 (2013)
Article DOI: 10.1016/j.ejmech.2013.03.056
BindingDB Entry DOI: 10.7270/Q2Q241N8
3D
3D Structure (crystal)
Coagulation factor X
(Homo sapiens (Human))
BDBM7840
(RIVAROXABAN | US8822458, 44 | US8822458, 97)
Show SMILES Clc1ccc(s1)C(=O)NC[C@H]1CN(C(=O)O1)c1ccc(cc1)N1CCOCC1=O |r|
Show InChI InChI=1S/C19H18ClN3O5S/c20-16-6-5-15(29-16)18(25)21-9-14-10-23(19(26)28-14)13-3-1-12(2-4-13)22-7-8-27-11-17(22)24/h1-6,14H,7-11H2,(H,21,25)/t14-/m0/s1
Reactome pathway
3.40n/an/an/an/an/an/an/an/a
Peking University
Curated by ChEMBL
Assay Description
Inhibition of human activated Factor X using S-2765 as substrate incubated for 15 mins followed by substrate addition and measured after 1 hr by chro...
Eur J Med Chem 183: (2019)
Article DOI: 10.1016/j.ejmech.2019.111722
3D
3D Structure (crystal)
Matriptase
(Homo sapiens (Human))
BDBM7840
(RIVAROXABAN | US8822458, 44 | US8822458, 97)
Show SMILES Clc1ccc(s1)C(=O)NC[C@H]1CN(C(=O)O1)c1ccc(cc1)N1CCOCC1=O |r|
Show InChI InChI=1S/C19H18ClN3O5S/c20-16-6-5-15(29-16)18(25)21-9-14-10-23(19(26)28-14)13-3-1-12(2-4-13)22-7-8-27-11-17(22)24/h1-6,14H,7-11H2,(H,21,25)/t14-/m0/s1
3.35E+3n/an/an/an/an/an/an/an/a
Washington University School of Medicine
Curated by ChEMBL
Assay Description
Inhibition of matripase (unknown origin) using Boc-QAR-AMC as substrate incubated for 30 mins prior to substrate addition by fluorescence assay
Bioorg Med Chem 23: 2328-43 (2015)
Article DOI: 10.1016/j.bmc.2015.03.072
BindingDB Entry DOI: 10.7270/Q23F4RB4
Coagulation factor X
(Homo sapiens (Human))
BDBM7840
(RIVAROXABAN | US8822458, 44 | US8822458, 97)
Show SMILES Clc1ccc(s1)C(=O)NC[C@H]1CN(C(=O)O1)c1ccc(cc1)N1CCOCC1=O |r|
Show InChI InChI=1S/C19H18ClN3O5S/c20-16-6-5-15(29-16)18(25)21-9-14-10-23(19(26)28-14)13-3-1-12(2-4-13)22-7-8-27-11-17(22)24/h1-6,14H,7-11H2,(H,21,25)/t14-/m0/s1
Reactome pathway
n/an/a 400n/an/an/an/an/an/a
Shenyang Pharmaceutical University
Curated by ChEMBL
Assay Description
Inhibition of F10a in human plasma assessed as doubling of prothombin time
Eur J Med Chem 96: 369-80 (2015)
Article DOI: 10.1016/j.ejmech.2015.04.025
BindingDB Entry DOI: 10.7270/Q22J6DKM
3D
3D Structure (crystal)
Coagulation factor X
(Homo sapiens (Human))
BDBM7840
(RIVAROXABAN | US8822458, 44 | US8822458, 97)
Show SMILES Clc1ccc(s1)C(=O)NC[C@H]1CN(C(=O)O1)c1ccc(cc1)N1CCOCC1=O |r|
Show InChI InChI=1S/C19H18ClN3O5S/c20-16-6-5-15(29-16)18(25)21-9-14-10-23(19(26)28-14)13-3-1-12(2-4-13)22-7-8-27-11-17(22)24/h1-6,14H,7-11H2,(H,21,25)/t14-/m0/s1
Reactome pathway
n/an/a 700n/an/an/an/an/an/a
Shenyang Pharmaceutical University
Curated by ChEMBL
Assay Description
Inhibition of F10a in human plasma assessed as doubling of activated partial thromboplastin time
Eur J Med Chem 96: 369-80 (2015)
Article DOI: 10.1016/j.ejmech.2015.04.025
BindingDB Entry DOI: 10.7270/Q22J6DKM
3D
3D Structure (crystal)
Coagulation factor X
(Homo sapiens (Human))
BDBM7840
(RIVAROXABAN | US8822458, 44 | US8822458, 97)
Show SMILES Clc1ccc(s1)C(=O)NC[C@H]1CN(C(=O)O1)c1ccc(cc1)N1CCOCC1=O |r|
Show InChI InChI=1S/C19H18ClN3O5S/c20-16-6-5-15(29-16)18(25)21-9-14-10-23(19(26)28-14)13-3-1-12(2-4-13)22-7-8-27-11-17(22)24/h1-6,14H,7-11H2,(H,21,25)/t14-/m0/s1
Reactome pathway
n/an/a 14n/an/an/an/an/an/a
Southeast University
Curated by ChEMBL
Assay Description
Inhibition of human F10a using S-2765 as substrate preincubated for 10 mins followed by substrate addition by microplate reader analysis
Eur J Med Chem 101: 41-51 (2015)
BindingDB Entry DOI: 10.7270/Q2TF004B
3D
3D Structure (crystal)
Coagulation factor X
(Homo sapiens (Human))
BDBM7840
(RIVAROXABAN | US8822458, 44 | US8822458, 97)
Show SMILES Clc1ccc(s1)C(=O)NC[C@H]1CN(C(=O)O1)c1ccc(cc1)N1CCOCC1=O |r|
Show InChI InChI=1S/C19H18ClN3O5S/c20-16-6-5-15(29-16)18(25)21-9-14-10-23(19(26)28-14)13-3-1-12(2-4-13)22-7-8-27-11-17(22)24/h1-6,14H,7-11H2,(H,21,25)/t14-/m0/s1
Reactome pathway
n/an/a 0.700n/an/an/an/an/an/a
Bristol-Myers Squibb Company
Curated by ChEMBL
Assay Description
Inhibition of factor 10a
J Med Chem 53: 6243-74 (2010)
Article DOI: 10.1021/jm100146h
BindingDB Entry DOI: 10.7270/Q2CR5VBB
3D
3D Structure (crystal)
Coagulation factor X
(Homo sapiens (Human))
BDBM7840
(RIVAROXABAN | US8822458, 44 | US8822458, 97)
Show SMILES Clc1ccc(s1)C(=O)NC[C@H]1CN(C(=O)O1)c1ccc(cc1)N1CCOCC1=O |r|
Show InChI InChI=1S/C19H18ClN3O5S/c20-16-6-5-15(29-16)18(25)21-9-14-10-23(19(26)28-14)13-3-1-12(2-4-13)22-7-8-27-11-17(22)24/h1-6,14H,7-11H2,(H,21,25)/t14-/m0/s1
Reactome pathway
n/an/a 1.60n/an/an/an/an/an/a
Zydus Research Centre
Curated by ChEMBL
Assay Description
Inhibition of human F10a using S-2765 as substrate after 45 mins
Eur J Med Chem 58: 136-52 (2012)
Article DOI: 10.1016/j.ejmech.2012.10.005
BindingDB Entry DOI: 10.7270/Q2571D4Q
3D
3D Structure (crystal)
Canalicular multispecific organic anion transporter 2
(Homo sapiens (Human))
BDBM7840
(RIVAROXABAN | US8822458, 44 | US8822458, 97)
Show SMILES Clc1ccc(s1)C(=O)NC[C@H]1CN(C(=O)O1)c1ccc(cc1)N1CCOCC1=O |r|
Show InChI InChI=1S/C19H18ClN3O5S/c20-16-6-5-15(29-16)18(25)21-9-14-10-23(19(26)28-14)13-3-1-12(2-4-13)22-7-8-27-11-17(22)24/h1-6,14H,7-11H2,(H,21,25)/t14-/m0/s1
Reactome pathway
n/an/a 1.33E+5n/an/an/an/an/an/a
Amgen Inc
Curated by ChEMBL
Assay Description
Inhibition of human MRP3 overexpressed in Sf9 insect cell membrane vesicles assessed as uptake of [3H]-estradiol-17beta-D-glucuronide in presence of ...
Toxicol Sci 136: 216-41 (2013)
BindingDB Entry DOI: 10.7270/Q2JM2D2D
Canalicular multispecific organic anion transporter 1
(Homo sapiens (Human))
BDBM7840
(RIVAROXABAN | US8822458, 44 | US8822458, 97)
Show SMILES Clc1ccc(s1)C(=O)NC[C@H]1CN(C(=O)O1)c1ccc(cc1)N1CCOCC1=O |r|
Show InChI InChI=1S/C19H18ClN3O5S/c20-16-6-5-15(29-16)18(25)21-9-14-10-23(19(26)28-14)13-3-1-12(2-4-13)22-7-8-27-11-17(22)24/h1-6,14H,7-11H2,(H,21,25)/t14-/m0/s1
n/an/a 1.33E+5n/an/an/an/an/an/a
Amgen Inc
Curated by ChEMBL
Assay Description
Inhibition of human MRP2 overexpressed in Sf9 cell membrane vesicles assessed as uptake of [3H]-estradiol-17beta-D-glucuronide in presence of ATP and...
Toxicol Sci 136: 216-41 (2013)
BindingDB Entry DOI: 10.7270/Q2JM2D2D
Multidrug resistance-associated protein 4
(Homo sapiens (Human))
BDBM7840
(RIVAROXABAN | US8822458, 44 | US8822458, 97)
Show SMILES Clc1ccc(s1)C(=O)NC[C@H]1CN(C(=O)O1)c1ccc(cc1)N1CCOCC1=O |r|
Show InChI InChI=1S/C19H18ClN3O5S/c20-16-6-5-15(29-16)18(25)21-9-14-10-23(19(26)28-14)13-3-1-12(2-4-13)22-7-8-27-11-17(22)24/h1-6,14H,7-11H2,(H,21,25)/t14-/m0/s1
Reactome pathway
n/an/a 1.33E+5n/an/an/an/an/an/a
Amgen Inc
Curated by ChEMBL
Assay Description
Inhibition of human MRP4 overexpressed in Sf9 cell membrane vesicles assessed as uptake of [3H]-estradiol-17beta-D-glucuronide in presence of ATP and...
Toxicol Sci 136: 216-41 (2013)
BindingDB Entry DOI: 10.7270/Q2JM2D2D
Bile salt export pump
(Homo sapiens (Human))
BDBM7840
(RIVAROXABAN | US8822458, 44 | US8822458, 97)
Show SMILES Clc1ccc(s1)C(=O)NC[C@H]1CN(C(=O)O1)c1ccc(cc1)N1CCOCC1=O |r|
Show InChI InChI=1S/C19H18ClN3O5S/c20-16-6-5-15(29-16)18(25)21-9-14-10-23(19(26)28-14)13-3-1-12(2-4-13)22-7-8-27-11-17(22)24/h1-6,14H,7-11H2,(H,21,25)/t14-/m0/s1
n/an/a 1.33E+5n/an/an/an/an/an/a
Amgen Inc
Curated by ChEMBL
Assay Description
Inhibition of human BSEP overexpressed in Sf9 cell membrane vesicles assessed as uptake of [3H]-taurocholate in presence of ATP measured after 15 to ...
Toxicol Sci 136: 216-41 (2013)
BindingDB Entry DOI: 10.7270/Q2JM2D2D
Coagulation factor X
(Homo sapiens (Human))
BDBM7840
(RIVAROXABAN | US8822458, 44 | US8822458, 97)
Show SMILES Clc1ccc(s1)C(=O)NC[C@H]1CN(C(=O)O1)c1ccc(cc1)N1CCOCC1=O |r|
Show InChI InChI=1S/C19H18ClN3O5S/c20-16-6-5-15(29-16)18(25)21-9-14-10-23(19(26)28-14)13-3-1-12(2-4-13)22-7-8-27-11-17(22)24/h1-6,14H,7-11H2,(H,21,25)/t14-/m0/s1
Reactome pathway
n/an/a 2.20n/an/an/an/an/an/a
Shenyang Pharmaceutical University
Curated by ChEMBL
Assay Description
Inhibition of human F10a using S-2765 as substrate after 45 mins by spectra max analysis
Eur J Med Chem 96: 369-80 (2015)
Article DOI: 10.1016/j.ejmech.2015.04.025
BindingDB Entry DOI: 10.7270/Q22J6DKM
3D
3D Structure (crystal)
Coagulation factor X
(Oryctolagus cuniculus)
BDBM7840
(RIVAROXABAN | US8822458, 44 | US8822458, 97)
Show SMILES Clc1ccc(s1)C(=O)NC[C@H]1CN(C(=O)O1)c1ccc(cc1)N1CCOCC1=O |r|
Show InChI InChI=1S/C19H18ClN3O5S/c20-16-6-5-15(29-16)18(25)21-9-14-10-23(19(26)28-14)13-3-1-12(2-4-13)22-7-8-27-11-17(22)24/h1-6,14H,7-11H2,(H,21,25)/t14-/m0/s1
n/an/a 860n/an/an/an/an/an/a
Shenyang Pharmaceutical University
Curated by ChEMBL
Assay Description
Inhibition of F10a in rabbit plasma assessed as doubling of activated partial thromboplastin time
Eur J Med Chem 96: 369-80 (2015)
Article DOI: 10.1016/j.ejmech.2015.04.025
BindingDB Entry DOI: 10.7270/Q22J6DKM
Coagulation factor X
(Oryctolagus cuniculus)
BDBM7840
(RIVAROXABAN | US8822458, 44 | US8822458, 97)
Show SMILES Clc1ccc(s1)C(=O)NC[C@H]1CN(C(=O)O1)c1ccc(cc1)N1CCOCC1=O |r|
Show InChI InChI=1S/C19H18ClN3O5S/c20-16-6-5-15(29-16)18(25)21-9-14-10-23(19(26)28-14)13-3-1-12(2-4-13)22-7-8-27-11-17(22)24/h1-6,14H,7-11H2,(H,21,25)/t14-/m0/s1
n/an/a 510n/an/an/an/an/an/a
Shenyang Pharmaceutical University
Curated by ChEMBL
Assay Description
Inhibition of F10a in rabbit plasma assessed as doubling of prothombin time
Eur J Med Chem 96: 369-80 (2015)
Article DOI: 10.1016/j.ejmech.2015.04.025
BindingDB Entry DOI: 10.7270/Q22J6DKM
Coagulation factor X
(Homo sapiens (Human))
BDBM7840
(RIVAROXABAN | US8822458, 44 | US8822458, 97)
Show SMILES Clc1ccc(s1)C(=O)NC[C@H]1CN(C(=O)O1)c1ccc(cc1)N1CCOCC1=O |r|
Show InChI InChI=1S/C19H18ClN3O5S/c20-16-6-5-15(29-16)18(25)21-9-14-10-23(19(26)28-14)13-3-1-12(2-4-13)22-7-8-27-11-17(22)24/h1-6,14H,7-11H2,(H,21,25)/t14-/m0/s1
Reactome pathway
n/an/a 8.5n/an/an/an/an/an/a
Chinese Academy of Sciences
Curated by ChEMBL
Assay Description
Inhibition of human factor 10a using N-Z-D-Arg-Gly-Arg-pNA, S-2765 chromogenic substrate
J Med Chem 57: 7770-91 (2014)
Article DOI: 10.1021/jm501045e
BindingDB Entry DOI: 10.7270/Q228095Z
3D
3D Structure (crystal)
Coagulation factor X
(Homo sapiens (Human))
BDBM7840
(RIVAROXABAN | US8822458, 44 | US8822458, 97)
Show SMILES Clc1ccc(s1)C(=O)NC[C@H]1CN(C(=O)O1)c1ccc(cc1)N1CCOCC1=O |r|
Show InChI InChI=1S/C19H18ClN3O5S/c20-16-6-5-15(29-16)18(25)21-9-14-10-23(19(26)28-14)13-3-1-12(2-4-13)22-7-8-27-11-17(22)24/h1-6,14H,7-11H2,(H,21,25)/t14-/m0/s1
Reactome pathway
n/an/a 0.700n/an/an/an/a8.325
Bayer HealthCare AG
Assay Description
The enzymatic activity was measured using chromogenic or fluorogenic substrates in 96-well microtiter plates.Color change was monitored continuously ...
J Med Chem 48: 5900-8 (2005)
Article DOI: 10.1021/jm050101d
BindingDB Entry DOI: 10.7270/Q2J38QR6
3D
3D Structure (crystal)
Coagulation factor X
(Homo sapiens (Human))
BDBM7840
(RIVAROXABAN | US8822458, 44 | US8822458, 97)
Show SMILES Clc1ccc(s1)C(=O)NC[C@H]1CN(C(=O)O1)c1ccc(cc1)N1CCOCC1=O |r|
Show InChI InChI=1S/C19H18ClN3O5S/c20-16-6-5-15(29-16)18(25)21-9-14-10-23(19(26)28-14)13-3-1-12(2-4-13)22-7-8-27-11-17(22)24/h1-6,14H,7-11H2,(H,21,25)/t14-/m0/s1
Reactome pathway
US Patent
n/an/a 1.40n/an/an/an/an/a25
Bayer Intellectual Property GmbH
US Patent
Assay Description
The enzymatic activity of human factor Xa (FXa) was measured using the conversion of a chromogenic substrate specific for FXa. Factor Xa cleaves p-ni...
US Patent US8822458 (2014)
BindingDB Entry DOI: 10.7270/Q2VH5MJ2
3D
3D Structure (crystal)
Coagulation factor X
(Homo sapiens (Human))
BDBM7840
(RIVAROXABAN | US8822458, 44 | US8822458, 97)
Show SMILES Clc1ccc(s1)C(=O)NC[C@H]1CN(C(=O)O1)c1ccc(cc1)N1CCOCC1=O |r|
Show InChI InChI=1S/C19H18ClN3O5S/c20-16-6-5-15(29-16)18(25)21-9-14-10-23(19(26)28-14)13-3-1-12(2-4-13)22-7-8-27-11-17(22)24/h1-6,14H,7-11H2,(H,21,25)/t14-/m0/s1
Reactome pathway
n/an/a 4.59n/an/an/an/an/an/a
Universidade do Porto (CEQUIMED-UP)
Curated by ChEMBL
Assay Description
Inhibition of human factor 10a assessed as CBS 31.39 substrate hydrolysis by spectrophotometric analysis
J Med Chem 54: 5373-84 (2011)
Article DOI: 10.1021/jm2006589
BindingDB Entry DOI: 10.7270/Q27P90HT
3D
3D Structure (crystal)
Coagulation factor X
(Homo sapiens (Human))
BDBM7840
(RIVAROXABAN | US8822458, 44 | US8822458, 97)
Show SMILES Clc1ccc(s1)C(=O)NC[C@H]1CN(C(=O)O1)c1ccc(cc1)N1CCOCC1=O |r|
Show InChI InChI=1S/C19H18ClN3O5S/c20-16-6-5-15(29-16)18(25)21-9-14-10-23(19(26)28-14)13-3-1-12(2-4-13)22-7-8-27-11-17(22)24/h1-6,14H,7-11H2,(H,21,25)/t14-/m0/s1
Reactome pathway
US Patent
n/an/a 700n/an/an/an/an/a25
Bayer Intellectual Property GmbH
US Patent
Assay Description
The enzymatic activity of human factor Xa (FXa) was measured using the conversion of a chromogenic substrate specific for FXa. Factor Xa cleaves p-ni...
US Patent US8822458 (2014)
BindingDB Entry DOI: 10.7270/Q2VH5MJ2
3D
3D Structure (crystal)