BDBM78555 6-(1,3-dioxo-1,3-dihydro-2H-isoindol-2-yl)-N-[4-(piperidin-1-ylsulfonyl)phenyl]hexanamide::6-(1,3-dioxo-2-isoindolyl)-N-[4-(1-piperidinylsulfonyl)phenyl]hexanamide::6-(1,3-dioxoisoindol-2-yl)-N-(4-piperidin-1-ylsulfonylphenyl)hexanamide::6-[1,3-bis(oxidanylidene)isoindol-2-yl]-N-(4-piperidin-1-ylsulfonylphenyl)hexanamide::6-phthalimido-N-(4-piperidinosulfonylphenyl)hexanamide::MLS000085228::SMR000019768::cid_3243667
SMILES: O=C(CCCCCN1C(=O)c2ccccc2C1=O)Nc1ccc(cc1)S(=O)(=O)N1CCCCC1
InChI Key: InChIKey=LXFDNFXNLGHABV-UHFFFAOYSA-N
Data: 3 IC50
Activity Spreadsheet -- Enzyme Inhibition Constant Data from BindingDB
Found 3 hits for monomerid = 78555
Trg + Lig
Ki
nM
ΔG°
kcal/mole
IC50
nM
Kd
nM
EC50/IC50
nM
koff
s-1
kon
M-1s-1
pHTemp
°C
ubiquitin-conjugating enzyme E2 N
(Homo sapiens (Human))
BDBM78555
(6-(1,3-dioxo-1,3-dihydro-2H-isoindol-2-yl)-N-[4-(p...)
Show SMILES O=C(CCCCCN1C(=O)c2ccccc2C1=O)Nc1ccc(cc1)S(=O)(=O)N1CCCCC1
Show InChI InChI=1S/C25H29N3O5S/c29-23(11-3-1-8-18-28-24(30)21-9-4-5-10-22(21)25(28)31)26-19-12-14-20(15-13-19)34(32,33)27-16-6-2-7-17-27/h4-5,9-10,12-15H,1-3,6-8,11,16-18H2,(H,26,29)
Reactome pathway
PCBioAssay
n/an/a 982n/an/an/an/an/an/a
Burnham Center for Chemical Genomics
Curated by PubChem BioAssay
Assay Description
Data Source: Sanford-Burnham Center for Chemical Genomics (SBCCG) Source Affiliation: Sanford-Burnham Medical Research Institute (SBMRI, San Diego CA...
PubChem Bioassay (2011)
BindingDB Entry DOI: 10.7270/Q2X34VX0
ubiquitin-conjugating enzyme E2 N
(Homo sapiens (Human))
BDBM78555
(6-(1,3-dioxo-1,3-dihydro-2H-isoindol-2-yl)-N-[4-(p...)
Show SMILES O=C(CCCCCN1C(=O)c2ccccc2C1=O)Nc1ccc(cc1)S(=O)(=O)N1CCCCC1
Show InChI InChI=1S/C25H29N3O5S/c29-23(11-3-1-8-18-28-24(30)21-9-4-5-10-22(21)25(28)31)26-19-12-14-20(15-13-19)34(32,33)27-16-6-2-7-17-27/h4-5,9-10,12-15H,1-3,6-8,11,16-18H2,(H,26,29)
Reactome pathway
PCBioAssay
n/an/a 1.34E+3n/an/an/an/an/an/a
Burnham Center for Chemical Genomics
Curated by PubChem BioAssay
Assay Description
Data Source: Sanford-Burnham Center for Chemical Genomics (SBCCG) Source Affiliation: Sanford-Burnham Medical Research Institute (SBMRI, San Diego CA...
PubChem Bioassay (2011)
BindingDB Entry DOI: 10.7270/Q2SB4462
Bfl-1
(Mus musculus (Mouse))
BDBM78555
(6-(1,3-dioxo-1,3-dihydro-2H-isoindol-2-yl)-N-[4-(p...)
Show SMILES O=C(CCCCCN1C(=O)c2ccccc2C1=O)Nc1ccc(cc1)S(=O)(=O)N1CCCCC1
Show InChI InChI=1S/C25H29N3O5S/c29-23(11-3-1-8-18-28-24(30)21-9-4-5-10-22(21)25(28)31)26-19-12-14-20(15-13-19)34(32,33)27-16-6-2-7-17-27/h4-5,9-10,12-15H,1-3,6-8,11,16-18H2,(H,26,29)
PCBioAssay
n/an/a>2.00E+4n/an/an/an/an/an/a
Burnham Center for Chemical Genomics
Curated by PubChem BioAssay
Assay Description
Data Source: Sanford-Burnham Center for Chemical Genomics (SBCCG) Source Affiliation: Sanford-Burnham Medical Research Institute (SBMRI, San Diego CA...
PubChem Bioassay (2011)
BindingDB Entry DOI: 10.7270/Q25D8Q92