null
SMILES: Cc1ccc(cc1)C1=NOC(=O)\C1=C/C=C/c1ccccc1
InChI Key: InChIKey=OCPXVDAZLOMXLU-WIXUPIFPSA-N
Activity Spreadsheet -- Enzyme Inhibition Constant Data from BindingDB
Found 2 hits for monomerid = 79418
Trg + Lig
Ki
nM
ΔG°
kcal/mole
IC50
nM
Kd
nM
EC50/IC50
nM
koff
s-1
kon
M-1s-1
pHTemp
°C
Perilipin-5
(Homo sapiens (Human))
BDBM79418
((4Z)-3-(4-methylphenyl)-4-[(E)-3-phenylprop-2-enyl...)
Show SMILES Cc1ccc(cc1)C1=NOC(=O)\C1=C/C=C/c1ccccc1 |t:8|
Show InChI InChI=1S/C19H15NO2/c1-14-10-12-16(13-11-14)18-17(19(21)22-20-18)9-5-8-15-6-3-2-4-7-15/h2-13H,1H3/b8-5+,17-9-
PCBioAssay
n/an/a 1.12E+3n/an/an/an/an/an/a
The Scripps Research Institute Molecular Screening Center
Curated by PubChem BioAssay
Assay Description
Source (MLPCN Center Name): The Scripps Research Institute Molecular Screening Center (SRIMSC) Affiliation: The Scripps Research Institute, TSRI Assa...
PubChem Bioassay (2011)
BindingDB Entry DOI: 10.7270/Q2D21W3H
Perilipin-1
(Homo sapiens (Human))
BDBM79418
((4Z)-3-(4-methylphenyl)-4-[(E)-3-phenylprop-2-enyl...)
Show SMILES Cc1ccc(cc1)C1=NOC(=O)\C1=C/C=C/c1ccccc1 |t:8|
Show InChI InChI=1S/C19H15NO2/c1-14-10-12-16(13-11-14)18-17(19(21)22-20-18)9-5-8-15-6-3-2-4-7-15/h2-13H,1H3/b8-5+,17-9-
Reactome pathway
PCBioAssay
n/an/a 1.23E+3n/an/an/an/an/an/a
The Scripps Research Institute Molecular Screening Center
Curated by PubChem BioAssay
Assay Description
Source (MLPCN Center Name): The Scripps Research Institute Molecular Screening Center (SRIMSC) Affiliation: The Scripps Research Institute, TSRI Assa...
PubChem Bioassay (2011)
BindingDB Entry DOI: 10.7270/Q2HT2MS2