null
SMILES: Cc1ccccc1NC(=O)CCS(=O)(=O)c1ccc(Br)s1
InChI Key: InChIKey=OFKPHZHFCFRCKG-UHFFFAOYSA-N
Activity Spreadsheet -- Enzyme Inhibition Constant Data from BindingDB
Found 1 hit for monomerid = 79510
Trg + Lig
Ki
nM
ΔG°
kcal/mole
IC50
nM
Kd
nM
EC50/IC50
nM
koff
s-1
kon
M-1s-1
pHTemp
°C
Beta-adrenergic receptor kinase 1
(Homo sapiens (Human))
BDBM79510
(3-(5-bromanylthiophen-2-yl)sulfonyl-N-(2-methylphe...)
Show SMILES Cc1ccccc1NC(=O)CCS(=O)(=O)c1ccc(Br)s1
Show InChI InChI=1S/C14H14BrNO3S2/c1-10-4-2-3-5-11(10)16-13(17)8-9-21(18,19)14-7-6-12(15)20-14/h2-7H,8-9H2,1H3,(H,16,17)
Reactome pathway
PCBioAssay
n/an/an/an/a 1.11E+4n/an/an/an/a
NMMLSC
Curated by PubChem BioAssay
Assay Description
University of New Mexico Assay Overview: Assay Support: 1 R03 DA030557-01A1 Project Title: RNA Aptamer-based screen for Selective Inhibitors of ...
PubChem Bioassay (2011)
BindingDB Entry DOI: 10.7270/Q2B56H72