BDBM79513 2-(3-bromophenylcarbamoyl)cyclohexanecarboxylic acid::2-[(3-bromoanilino)-oxomethyl]-1-cyclohexanecarboxylic acid::2-[(3-bromophenyl)carbamoyl]cyclohexane-1-carboxylic acid::2-[(3-bromophenyl)carbamoyl]cyclohexanecarboxylic acid::MLS002152987::SMR001229049::cid_5019976
SMILES: OC(=O)C1CCCCC1C(=O)Nc1cccc(Br)c1
InChI Key: InChIKey=RNUCHTKNUCXXPR-UHFFFAOYSA-N
Data: 1 IC50  1 EC50
Activity Spreadsheet -- Enzyme Inhibition Constant Data from BindingDB
Found 2 hits for monomerid = 79513
Trg + Lig
Ki
nM
ΔG°
kcal/mole
IC50
nM
Kd
nM
EC50/IC50
nM
koff
s-1
kon
M-1s-1
pHTemp
°C
Carboxy-terminal domain RNA polymerase II polypeptide A small phosphatase 1
(Homo sapiens (Human))
BDBM79513
(2-(3-bromophenylcarbamoyl)cyclohexanecarboxylic ac...)
Show SMILES OC(=O)C1CCCCC1C(=O)Nc1cccc(Br)c1
Show InChI InChI=1S/C14H16BrNO3/c15-9-4-3-5-10(8-9)16-13(17)11-6-1-2-7-12(11)14(18)19/h3-5,8,11-12H,1-2,6-7H2,(H,16,17)(H,18,19)
PCBioAssay
n/an/a 3.06E+3n/an/an/an/an/an/a
Burnham Center for Chemical Genomics
Curated by PubChem BioAssay
Assay Description
Data Source: Sanford-Burnham Center for Chemical Genomics (SBCCG) Source Affiliation: Sanford-Burnham Medical Research Institute (SBMRI, San Diego, C...
PubChem Bioassay (2011)
BindingDB Entry DOI: 10.7270/Q2V986KM
Beta-adrenergic receptor kinase 1
(Homo sapiens (Human))
BDBM79513
(2-(3-bromophenylcarbamoyl)cyclohexanecarboxylic ac...)
Show SMILES OC(=O)C1CCCCC1C(=O)Nc1cccc(Br)c1
Show InChI InChI=1S/C14H16BrNO3/c15-9-4-3-5-10(8-9)16-13(17)11-6-1-2-7-12(11)14(18)19/h3-5,8,11-12H,1-2,6-7H2,(H,16,17)(H,18,19)
Reactome pathway
PCBioAssay
n/an/an/an/a 3.85E+3n/an/an/an/a
NMMLSC
Curated by PubChem BioAssay
Assay Description
University of New Mexico Assay Overview: Assay Support: 1 R03 DA030557-01A1 Project Title: RNA Aptamer-based screen for Selective Inhibitors of ...
PubChem Bioassay (2011)
BindingDB Entry DOI: 10.7270/Q2B56H72