BDBM80001 MLS000724611::N-(4,7-dimethyl-1,3-benzothiazol-2-yl)-1,3-benzothiazole-2-carboxamide::SMR000237428::cid_4454088
SMILES: Cc1ccc(C)c2sc(NC(=O)c3nc4ccccc4s3)nc12
InChI Key: InChIKey=WNLTZYYJNWEBOP-UHFFFAOYSA-N
Data: 2 IC50
Activity Spreadsheet -- Enzyme Inhibition Constant Data from BindingDB
Found 2 hits for monomerid = 80001
Trg + Lig
Ki
nM
ΔG°
kcal/mole
IC50
nM
Kd
nM
EC50/IC50
nM
koff
s-1
kon
M-1s-1
pHTemp
°C
C-C chemokine receptor type 6 (CCR6)
(Homo sapiens (Human))
BDBM80001
(MLS000724611 | N-(4,7-dimethyl-1,3-benzothiazol-2-...)
Show SMILES Cc1ccc(C)c2sc(NC(=O)c3nc4ccccc4s3)nc12
Show InChI InChI=1S/C17H13N3OS2/c1-9-7-8-10(2)14-13(9)19-17(23-14)20-15(21)16-18-11-5-3-4-6-12(11)22-16/h3-8H,1-2H3,(H,19,20,21)
PCBioAssay
n/an/a 869n/an/an/an/an/an/a
Burnham Center for Chemical Genomics
Curated by PubChem BioAssay
Assay Description
Data Source: Sanford-Burnham Center for Chemical Genomics (SBCCG) Source Affiliation: Sanford-Burnham Medical Research Institute(SBMRI, San Diego, CA...
PubChem Bioassay (2011)
BindingDB Entry DOI: 10.7270/Q20P0XHD
Beta-galactosidase
(Escherichia coli)
BDBM80001
(MLS000724611 | N-(4,7-dimethyl-1,3-benzothiazol-2-...)
Show SMILES Cc1ccc(C)c2sc(NC(=O)c3nc4ccccc4s3)nc12
Show InChI InChI=1S/C17H13N3OS2/c1-9-7-8-10(2)14-13(9)19-17(23-14)20-15(21)16-18-11-5-3-4-6-12(11)22-16/h3-8H,1-2H3,(H,19,20,21)
PCBioAssay
n/an/a>6.66E+4n/an/an/an/an/an/a
Burnham Center for Chemical Genomics
Curated by PubChem BioAssay
Assay Description
Data Source: Sanford-Burnham Center for Chemical Genomics (SBCCG) Source Affiliation: Sanford-Burnham Medical Research Institute(SBMRI, San Diego, C...
PubChem Bioassay (2011)
BindingDB Entry DOI: 10.7270/Q2NG4P4X