BDBM80072 (6E)-6-[1-(2-quinolin-2-ylhydrazinyl)ethylidene]cyclohexa-2,4-dien-1-one::(6E)-6-[1-(2-quinolinylhydrazo)ethylidene]-1-cyclohexa-2,4-dienone::(6E)-6-[1-[N'-(2-quinolyl)hydrazino]ethylidene]cyclohexa-2,4-dien-1-one::(6Z)-6-[1-[N''-(2-quinolyl)hydrazino]ethylidene]cyclohexa-2,4-dien-1-one::(6Z)-6-[1-[N'-(2-quinolyl)hydrazino]ethylidene]cyclohexa-2,4-dien-1-one::MLS002702053::SMR001565625::cid_5383429
SMILES: CC(N=Nc1ccc2ccccc2n1)c1ccccc1O
InChI Key: InChIKey=UYNOFLBIBOGFHX-UHFFFAOYSA-N
Data: 4 IC50
Activity Spreadsheet -- Enzyme Inhibition Constant Data from BindingDB
Found 4 hits for monomerid = 80072
Trg + Lig
Ki
nM
ΔG°
kcal/mole
IC50
nM
Kd
nM
EC50/IC50
nM
koff
s-1
kon
M-1s-1
pHTemp
°C
Beta-galactosidase
(Escherichia coli)
BDBM80072
((6E)-6-[1-(2-quinolin-2-ylhydrazinyl)ethylidene]cy...)
Show SMILES CC(N=Nc1ccc2ccccc2n1)c1ccccc1O |w:2.1|
Show InChI InChI=1S/C17H15N3O/c1-12(14-7-3-5-9-16(14)21)19-20-17-11-10-13-6-2-4-8-15(13)18-17/h2-12,21H,1H3
PCBioAssay
n/an/a>6.66E+4n/an/an/an/an/an/a
Burnham Center for Chemical Genomics
Curated by PubChem BioAssay
Assay Description
Data Source: Sanford-Burnham Center for Chemical Genomics (SBCCG) Source Affiliation: Sanford-Burnham Medical Research Institute(SBMRI, San Diego, C...
PubChem Bioassay (2011)
BindingDB Entry DOI: 10.7270/Q2NG4P4X
C-C chemokine receptor type 6 (CCR6)
(Homo sapiens (Human))
BDBM80072
((6E)-6-[1-(2-quinolin-2-ylhydrazinyl)ethylidene]cy...)
Show SMILES CC(N=Nc1ccc2ccccc2n1)c1ccccc1O |w:2.1|
Show InChI InChI=1S/C17H15N3O/c1-12(14-7-3-5-9-16(14)21)19-20-17-11-10-13-6-2-4-8-15(13)18-17/h2-12,21H,1H3
PCBioAssay
n/an/a 9.03E+3n/an/an/an/an/an/a
Burnham Center for Chemical Genomics
Curated by PubChem BioAssay
Assay Description
Data Source: Sanford-Burnham Center for Chemical Genomics (SBCCG) Source Affiliation: Sanford-Burnham Medical Research Institute(SBMRI, San Diego, CA...
PubChem Bioassay (2011)
BindingDB Entry DOI: 10.7270/Q2QJ7FTF
Apelin receptor
(Homo sapiens (Human))
BDBM80072
((6E)-6-[1-(2-quinolin-2-ylhydrazinyl)ethylidene]cy...)
Show SMILES CC(N=Nc1ccc2ccccc2n1)c1ccccc1O |w:2.1|
Show InChI InChI=1S/C17H15N3O/c1-12(14-7-3-5-9-16(14)21)19-20-17-11-10-13-6-2-4-8-15(13)18-17/h2-12,21H,1H3
Reactome pathway
PCBioAssay
n/an/a 4.12E+3n/an/an/an/an/an/a
Burnham Center for Chemical Genomics
Curated by PubChem BioAssay
Assay Description
Data Source: Sanford-Burnham Center for Chemical Genomics (SBCCG) Source Affiliation: Sanford-Burnham Medical Research Institute(SBMRI, San Diego, CA...
PubChem Bioassay (2011)
BindingDB Entry DOI: 10.7270/Q2B856NC
C-C chemokine receptor type 6 (CCR6)
(Homo sapiens (Human))
BDBM80072
((6E)-6-[1-(2-quinolin-2-ylhydrazinyl)ethylidene]cy...)
Show SMILES CC(N=Nc1ccc2ccccc2n1)c1ccccc1O |w:2.1|
Show InChI InChI=1S/C17H15N3O/c1-12(14-7-3-5-9-16(14)21)19-20-17-11-10-13-6-2-4-8-15(13)18-17/h2-12,21H,1H3
PCBioAssay
n/an/a 1.72E+4n/an/an/an/an/an/a
Burnham Center for Chemical Genomics
Curated by PubChem BioAssay
Assay Description
Data Source: Sanford-Burnham Center for Chemical Genomics (SBCCG) Source Affiliation: Sanford-Burnham Medical Research Institute(SBMRI, San Diego, CA...
PubChem Bioassay (2011)
BindingDB Entry DOI: 10.7270/Q20P0XHD