BDBM8008 (2R,3R,4R,5R)-3,4-dihydroxy-N,N'-bis[(1S,2R)-2-hydroxy-2,3-dihydro-1H-inden-1-yl]-2,5-bis({[(2E)-3-(thiophen-3-yl)prop-2-en-1-yl]oxy})hexanediamide::(2R,3R,4R,5R)-N1,N6-Bis[(1S,2R)-2-hydroxy-1-indanyl]-2,5-bis[(2E)-3-(3-thienyl)-2-propenyloxy]-3,4-dihydroxy-hexane-1,6-diamide::C2-symmetric compound 16
SMILES: O[C@H]([C@@H](O)[C@@H](OC\C=C\c1ccsc1)C(=O)N[C@@H]1[C@H](O)Cc2ccccc12)[C@@H](OC\C=C\c1ccsc1)C(=O)N[C@@H]1[C@H](O)Cc2ccccc12
InChI Key: InChIKey=TXDXOHWBGXPYCM-YTYKLZEWSA-N
Data: 3 KI
Activity Spreadsheet -- Enzyme Inhibition Constant Data from BindingDB
Found 3 hits for monomerid = 8008
Trg + Lig
Ki
nM
ΔG°
kcal/mole
IC50
nM
Kd
nM
EC50/IC50
nM
koff
s-1
kon
M-1s-1
pHTemp
°C
Plasmepsin I
(Plasmodium falciparum)
BDBM8008
((2R,3R,4R,5R)-3,4-dihydroxy-N,N'-bis[(1S,2R)-2-hyd...)
Show SMILES O[C@H]([C@@H](O)[C@@H](OC\C=C\c1ccsc1)C(=O)N[C@@H]1[C@H](O)Cc2ccccc12)[C@@H](OC\C=C\c1ccsc1)C(=O)N[C@@H]1[C@H](O)Cc2ccccc12 |r|
Show InChI InChI=1S/C38H40N2O8S2/c41-29-19-25-9-1-3-11-27(25)31(29)39-37(45)35(47-15-5-7-23-13-17-49-21-23)33(43)34(44)36(48-16-6-8-24-14-18-50-22-24)38(46)40-32-28-12-4-2-10-26(28)20-30(32)42/h1-14,17-18,21-22,29-36,41-44H,15-16,19-20H2,(H,39,45)(H,40,46)/b7-5+,8-6+/t29-,30-,31+,32+,33-,34-,35-,36-/m1/s1
1.30n/an/an/an/an/an/an/an/a
Uppsala University
Assay Description
Enzyme activities were assayed by monitoring the hydrolysis of substrate in the presence or absence of inhibitor compounds. The hydrolysis was record...
J Med Chem 47: 110-22 (2004)
Article DOI: 10.1021/jm030933g
BindingDB Entry DOI: 10.7270/Q2RV0KX6
Plasmepsin 2
(Plasmodium falciparum)
BDBM8008
((2R,3R,4R,5R)-3,4-dihydroxy-N,N'-bis[(1S,2R)-2-hyd...)
Show SMILES O[C@H]([C@@H](O)[C@@H](OC\C=C\c1ccsc1)C(=O)N[C@@H]1[C@H](O)Cc2ccccc12)[C@@H](OC\C=C\c1ccsc1)C(=O)N[C@@H]1[C@H](O)Cc2ccccc12 |r|
Show InChI InChI=1S/C38H40N2O8S2/c41-29-19-25-9-1-3-11-27(25)31(29)39-37(45)35(47-15-5-7-23-13-17-49-21-23)33(43)34(44)36(48-16-6-8-24-14-18-50-22-24)38(46)40-32-28-12-4-2-10-26(28)20-30(32)42/h1-14,17-18,21-22,29-36,41-44H,15-16,19-20H2,(H,39,45)(H,40,46)/b7-5+,8-6+/t29-,30-,31+,32+,33-,34-,35-,36-/m1/s1
15 -10.6n/an/an/an/an/a4.522
Uppsala University
Assay Description
Enzyme activities were assayed by monitoring the hydrolysis of substrate in the presence or absence of inhibitor compounds. The hydrolysis was record...
J Med Chem 47: 110-22 (2004)
Article DOI: 10.1021/jm030933g
BindingDB Entry DOI: 10.7270/Q2RV0KX6
Cathepsin D
(Homo sapiens (Human))
BDBM8008
((2R,3R,4R,5R)-3,4-dihydroxy-N,N'-bis[(1S,2R)-2-hyd...)
Show SMILES O[C@H]([C@@H](O)[C@@H](OC\C=C\c1ccsc1)C(=O)N[C@@H]1[C@H](O)Cc2ccccc12)[C@@H](OC\C=C\c1ccsc1)C(=O)N[C@@H]1[C@H](O)Cc2ccccc12 |r|
Show InChI InChI=1S/C38H40N2O8S2/c41-29-19-25-9-1-3-11-27(25)31(29)39-37(45)35(47-15-5-7-23-13-17-49-21-23)33(43)34(44)36(48-16-6-8-24-14-18-50-22-24)38(46)40-32-28-12-4-2-10-26(28)20-30(32)42/h1-14,17-18,21-22,29-36,41-44H,15-16,19-20H2,(H,39,45)(H,40,46)/b7-5+,8-6+/t29-,30-,31+,32+,33-,34-,35-,36-/m1/s1
NCI pathway
Reactome pathway
>2.00E+3n/an/an/an/an/an/an/an/a
Uppsala University
Assay Description
Enzyme activities were assayed by monitoring the hydrolysis of substrate in the presence or absence of inhibitor compounds. The hydrolysis was record...
J Med Chem 47: 110-22 (2004)
Article DOI: 10.1021/jm030933g
BindingDB Entry DOI: 10.7270/Q2RV0KX6