null
SMILES: CCN1[C@H](C)[C@H]([C@@H](N=C1NCCc1cccnc1)c1ccccc1)C(=O)OC
InChI Key: InChIKey=HQMPZXHJADPLRQ-AHRSYUTCSA-N
Activity Spreadsheet -- Enzyme Inhibition Constant Data from BindingDB
Found 3 hits for monomerid = 80578
Trg + Lig
Ki
nM
ΔG°
kcal/mole
IC50
nM
Kd
nM
EC50/IC50
nM
koff
s-1
kon
M-1s-1
pHTemp
°C
DNA dC->dU-editing enzyme APOBEC-3A
(Homo sapiens (Human))
BDBM80578
((4R,5R,6R)-1-ethyl-6-methyl-4-phenyl-2-[2-(3-pyrid...)
Show SMILES CCN1[C@H](C)[C@H]([C@@H](N=C1NCCc1cccnc1)c1ccccc1)C(=O)OC |c:7|
Show InChI InChI=1S/C22H28N4O2/c1-4-26-16(2)19(21(27)28-3)20(18-10-6-5-7-11-18)25-22(26)24-14-12-17-9-8-13-23-15-17/h5-11,13,15-16,19-20H,4,12,14H2,1-3H3,(H,24,25)/t16-,19-,20+/m1/s1
PCBioAssay
n/an/a 4.22E+3n/an/an/an/an/a25
Burnham Center for Chemical Genomics
Curated by PubChem BioAssay
Assay Description
Data Source: Sanford-Burnham Center for Chemical Genomics (SBCCG) Source Affiliation: Sanford-Burnham Medical Research Institute (SBMRI, San Diego, C...
PubChem Bioassay (2011)
BindingDB Entry DOI: 10.7270/Q24F1P6P
High affinity choline transporter 1
(Homo sapiens (Human))
BDBM80578
((4R,5R,6R)-1-ethyl-6-methyl-4-phenyl-2-[2-(3-pyrid...)
Show SMILES CCN1[C@H](C)[C@H]([C@@H](N=C1NCCc1cccnc1)c1ccccc1)C(=O)OC |c:7|
Show InChI InChI=1S/C22H28N4O2/c1-4-26-16(2)19(21(27)28-3)20(18-10-6-5-7-11-18)25-22(26)24-14-12-17-9-8-13-23-15-17/h5-11,13,15-16,19-20H,4,12,14H2,1-3H3,(H,24,25)/t16-,19-,20+/m1/s1
Reactome pathway
PCBioAssay
n/an/an/an/a 1.46E+4n/an/an/an/a
Johns Hopkins Ion Channel Center
Curated by PubChem BioAssay
Assay Description
Data Source (MLPCN Center Name): Johns Hopkins Ion Channel Center (JHICC) Center Affiliation: Johns Hopkins University, School of Medicine Screening ...
PubChem Bioassay (2012)
BindingDB Entry DOI: 10.7270/Q21N7ZQ4
DNA dC->dU-editing enzyme APOBEC-3G
(Homo sapiens (Human))
BDBM80578
((4R,5R,6R)-1-ethyl-6-methyl-4-phenyl-2-[2-(3-pyrid...)
Show SMILES CCN1[C@H](C)[C@H]([C@@H](N=C1NCCc1cccnc1)c1ccccc1)C(=O)OC |c:7|
Show InChI InChI=1S/C22H28N4O2/c1-4-26-16(2)19(21(27)28-3)20(18-10-6-5-7-11-18)25-22(26)24-14-12-17-9-8-13-23-15-17/h5-11,13,15-16,19-20H,4,12,14H2,1-3H3,(H,24,25)/t16-,19-,20+/m1/s1
PCBioAssay
n/an/a 6.37E+3n/an/an/an/an/a25
Burnham Center for Chemical Genomics
Curated by PubChem BioAssay
Assay Description
Data Source: Sanford-Burnham Center for Chemical Genomics (SBCCG) Source Affiliation: Sanford-Burnham Medical Research Institute (SBMRI, San Diego, C...
PubChem Bioassay (2011)
BindingDB Entry DOI: 10.7270/Q2862DX0