null
SMILES: Cc1[nH]c(C#N)c(C)c1-c1ccnc(Nc2cccc(c2)N(=O)=O)n1
InChI Key: InChIKey=QMDPRICJPXKZCF-UHFFFAOYSA-N
Activity Spreadsheet -- Enzyme Inhibition Constant Data from BindingDB
Found 2 hits for monomerid = 8071
Trg + Lig
Ki
nM
ΔG°
kcal/mole
IC50
nM
Kd
nM
EC50/IC50
nM
koff
s-1
kon
M-1s-1
pHTemp
°C
Cyclin-dependent kinase 2/G1/S-specific cyclin-E1
(Homo sapiens (Human))
BDBM8071
(2-anilino-4-(1H-pyrrol-3-yl) pyrimidine deriv. 8b ...)
Show SMILES Cc1[nH]c(C#N)c(C)c1-c1ccnc(Nc2cccc(c2)N(=O)=O)n1
Show InChI InChI=1S/C17H14N6O2/c1-10-15(9-18)20-11(2)16(10)14-6-7-19-17(22-14)21-12-4-3-5-13(8-12)23(24)25/h3-8,20H,1-2H3,(H,19,21,22)
140 -9.50n/an/an/an/an/a7.430
Cyclacel Limited
Assay Description
In vitro kinase assay using purified enzyme, was incubated at 30 °C with substrate, and test compounds in the presence of 100 uM ATP/ [gamma-32P...
Bioorg Med Chem Lett 14: 4237-40 (2004)
Article DOI: 10.1016/j.bmcl.2004.06.012
BindingDB Entry DOI: 10.7270/Q2CJ8BPP
Cyclin-dependent kinase 4/G1/S-specific cyclin-D1
(Homo sapiens (Human))
BDBM8071
(2-anilino-4-(1H-pyrrol-3-yl) pyrimidine deriv. 8b ...)
Show SMILES Cc1[nH]c(C#N)c(C)c1-c1ccnc(Nc2cccc(c2)N(=O)=O)n1
Show InChI InChI=1S/C17H14N6O2/c1-10-15(9-18)20-11(2)16(10)14-6-7-19-17(22-14)21-12-4-3-5-13(8-12)23(24)25/h3-8,20H,1-2H3,(H,19,21,22)
NCI pathway
Reactome pathway
960 -8.34n/an/an/an/an/an/a30
Cyclacel Limited
Assay Description
In vitro kinase assay using purified enzyme, was incubated at 30 °C with substrate, and test compounds in the presence of 100 uM ATP/ [gamma-32P...
Bioorg Med Chem Lett 14: 4237-40 (2004)
Article DOI: 10.1016/j.bmcl.2004.06.012
BindingDB Entry DOI: 10.7270/Q2CJ8BPP