BDBM80764 MLS000031522::N-[2-[4-(2-hydroxyethyl)-1-piperazinyl]-1,2-dihydroacenaphthylen-1-yl]benzenesulfonamide::N-[2-[4-(2-hydroxyethyl)piperazin-1-yl]-1,2-dihydroacenaphthylen-1-yl]benzenesulfonamide::N-[2-[4-(2-hydroxyethyl)piperazino]acenaphthen-1-yl]benzenesulfonamide::N-{2-[4-(2-Hydroxy-ethyl)-piperazin-1-yl]-acenaphthen-1-yl}-benzenesulfonamide::SMR000012563::cid_654682
SMILES: OCCN1CCN(CC1)C1C(NS(=O)(=O)c2ccccc2)c2cccc3cccc1c23
InChI Key: InChIKey=JQAJLVIVGYEBAG-UHFFFAOYSA-N
Data: 2 EC50
Activity Spreadsheet -- Enzyme Inhibition Constant Data from BindingDB
Found 2 hits for monomerid = 80764
Trg + Lig
Ki
nM
ΔG°
kcal/mole
IC50
nM
Kd
nM
EC50/IC50
nM
koff
s-1
kon
M-1s-1
pHTemp
°C
Hexokinase-1
(Homo sapiens (Human))
BDBM80764
(MLS000031522 | N-[2-[4-(2-hydroxyethyl)-1-piperazi...)
Show SMILES OCCN1CCN(CC1)C1C(NS(=O)(=O)c2ccccc2)c2cccc3cccc1c23
Show InChI InChI=1S/C24H27N3O3S/c28-17-16-26-12-14-27(15-13-26)24-21-11-5-7-18-6-4-10-20(22(18)21)23(24)25-31(29,30)19-8-2-1-3-9-19/h1-11,23-25,28H,12-17H2
NCI pathway
Reactome pathway
PCBioAssay
n/an/an/an/a 2.40E+4n/an/an/an/a
Burnham Center for Chemical Genomics
Curated by PubChem BioAssay
Assay Description
Data Source: Sanford-Burnham Center for Chemical Genomics (SBCCG) Source Affiliation: Sanford-Burnham Medical Research Institute (SBMRI, San Diego, C...
PubChem Bioassay (2011)
BindingDB Entry DOI: 10.7270/Q2765CSM
Hexokinase HKDC1 [W721R]
(Homo sapiens (Human))
BDBM80764
(MLS000031522 | N-[2-[4-(2-hydroxyethyl)-1-piperazi...)
Show SMILES OCCN1CCN(CC1)C1C(NS(=O)(=O)c2ccccc2)c2cccc3cccc1c23
Show InChI InChI=1S/C24H27N3O3S/c28-17-16-26-12-14-27(15-13-26)24-21-11-5-7-18-6-4-10-20(22(18)21)23(24)25-31(29,30)19-8-2-1-3-9-19/h1-11,23-25,28H,12-17H2
PCBioAssay
n/an/an/an/a 1.81E+4n/an/an/an/a
Burnham Center for Chemical Genomics
Curated by PubChem BioAssay
Assay Description
Data Source: Sanford-Burnham Center for Chemical Genomics (SBCCG) Source Affiliation: Sanford-Burnham Medical Research Institute (SBMRI, San Diego, C...
PubChem Bioassay (2011)
BindingDB Entry DOI: 10.7270/Q2R78CQV