null
SMILES: Cc1[nH]c(c(C)c1-c1ccnc(Nc2ccc(F)cc2)n1)N(=O)=O
InChI Key: InChIKey=IJIHKBKIAXXWCC-UHFFFAOYSA-N
Activity Spreadsheet -- Enzyme Inhibition Constant Data from BindingDB
Found 2 hits for monomerid = 8079
Trg + Lig
Ki
nM
ΔG°
kcal/mole
IC50
nM
Kd
nM
EC50/IC50
nM
koff
s-1
kon
M-1s-1
pHTemp
°C
Cyclin-dependent kinase 2/G1/S-specific cyclin-E1
(Homo sapiens (Human))
BDBM8079
(2-anilino-4-(1H-pyrrol-3-yl) pyrimidine deriv. 8j ...)
Show SMILES Cc1[nH]c(c(C)c1-c1ccnc(Nc2ccc(F)cc2)n1)N(=O)=O
Show InChI InChI=1S/C16H14FN5O2/c1-9-14(10(2)19-15(9)22(23)24)13-7-8-18-16(21-13)20-12-5-3-11(17)4-6-12/h3-8,19H,1-2H3,(H,18,20,21)
30 -10.4n/an/an/an/an/a7.430
Cyclacel Limited
Assay Description
In vitro kinase assay using purified enzyme, was incubated at 30 °C with substrate, and test compounds in the presence of 100 uM ATP/ [gamma-32P...
Bioorg Med Chem Lett 14: 4237-40 (2004)
Article DOI: 10.1016/j.bmcl.2004.06.012
BindingDB Entry DOI: 10.7270/Q2CJ8BPP
Cyclin-dependent kinase 4/G1/S-specific cyclin-D1
(Homo sapiens (Human))
BDBM8079
(2-anilino-4-(1H-pyrrol-3-yl) pyrimidine deriv. 8j ...)
Show SMILES Cc1[nH]c(c(C)c1-c1ccnc(Nc2ccc(F)cc2)n1)N(=O)=O
Show InChI InChI=1S/C16H14FN5O2/c1-9-14(10(2)19-15(9)22(23)24)13-7-8-18-16(21-13)20-12-5-3-11(17)4-6-12/h3-8,19H,1-2H3,(H,18,20,21)
NCI pathway
Reactome pathway
120 -9.59n/an/an/an/an/an/a30
Cyclacel Limited
Assay Description
In vitro kinase assay using purified enzyme, was incubated at 30 °C with substrate, and test compounds in the presence of 100 uM ATP/ [gamma-32P...
Bioorg Med Chem Lett 14: 4237-40 (2004)
Article DOI: 10.1016/j.bmcl.2004.06.012
BindingDB Entry DOI: 10.7270/Q2CJ8BPP