BDBM8084 (2S)-N-[(2S,3S)-4-{[(1S)-2-(4-bromophenyl)-1-carbamoylethyl]amino}-3-hydroxy-1-phenylbutan-2-yl]-2-[3-(1H-indol-3-yl)propanamido]-3-methylbutanamide::hydroxylethylamine scaffold 53::hydroxylethylamine scaffold 5{3}
SMILES: CC(C)[C@H](NC(=O)CCc1c[nH]c2ccccc12)C(=O)N[C@@H](Cc1ccccc1)[C@@H](O)CN[C@@H](Cc1ccc(Br)cc1)C(N)=O
InChI Key: InChIKey=QPBQADMUKPPEIW-QUUJSONZSA-N
Data: 3 KI
Activity Spreadsheet -- Enzyme Inhibition Constant Data from BindingDB
Found 3 hits for monomerid = 8084
Trg + Lig
Ki
nM
ΔG°
kcal/mole
IC50
nM
Kd
nM
EC50/IC50
nM
koff
s-1
kon
M-1s-1
pHTemp
°C
Plasmepsin I
(Plasmodium falciparum)
BDBM8084
((2S)-N-[(2S,3S)-4-{[(1S)-2-(4-bromophenyl)-1-carba...)
Show SMILES CC(C)[C@H](NC(=O)CCc1c[nH]c2ccccc12)C(=O)N[C@@H](Cc1ccccc1)[C@@H](O)CN[C@@H](Cc1ccc(Br)cc1)C(N)=O |r|
Show InChI InChI=1S/C35H42BrN5O4/c1-22(2)33(41-32(43)17-14-25-20-38-28-11-7-6-10-27(25)28)35(45)40-29(18-23-8-4-3-5-9-23)31(42)21-39-30(34(37)44)19-24-12-15-26(36)16-13-24/h3-13,15-16,20,22,29-31,33,38-39,42H,14,17-19,21H2,1-2H3,(H2,37,44)(H,40,45)(H,41,43)/t29-,30-,31-,33-/m0/s1
4.70n/an/an/an/an/an/an/an/a
Uppsala University
Assay Description
Enzyme activities were assayed by monitoring the hydrolysis of substrate in the presence or absence of inhibitor compounds. The hydrolysis was record...
J Comb Chem 5: 456-64 (2003)
Article DOI: 10.1021/cc0301014
BindingDB Entry DOI: 10.7270/Q27S7KZZ
Plasmepsin 2
(Plasmodium falciparum)
BDBM8084
((2S)-N-[(2S,3S)-4-{[(1S)-2-(4-bromophenyl)-1-carba...)
Show SMILES CC(C)[C@H](NC(=O)CCc1c[nH]c2ccccc12)C(=O)N[C@@H](Cc1ccccc1)[C@@H](O)CN[C@@H](Cc1ccc(Br)cc1)C(N)=O |r|
Show InChI InChI=1S/C35H42BrN5O4/c1-22(2)33(41-32(43)17-14-25-20-38-28-11-7-6-10-27(25)28)35(45)40-29(18-23-8-4-3-5-9-23)31(42)21-39-30(34(37)44)19-24-12-15-26(36)16-13-24/h3-13,15-16,20,22,29-31,33,38-39,42H,14,17-19,21H2,1-2H3,(H2,37,44)(H,40,45)(H,41,43)/t29-,30-,31-,33-/m0/s1
140 -9.25n/an/an/an/an/a4.522
Uppsala University
Assay Description
Enzyme activities were assayed by monitoring the hydrolysis of substrate in the presence or absence of inhibitor compounds. The hydrolysis was record...
J Comb Chem 5: 456-64 (2003)
Article DOI: 10.1021/cc0301014
BindingDB Entry DOI: 10.7270/Q27S7KZZ
Cathepsin D
(Homo sapiens (Human))
BDBM8084
((2S)-N-[(2S,3S)-4-{[(1S)-2-(4-bromophenyl)-1-carba...)
Show SMILES CC(C)[C@H](NC(=O)CCc1c[nH]c2ccccc12)C(=O)N[C@@H](Cc1ccccc1)[C@@H](O)CN[C@@H](Cc1ccc(Br)cc1)C(N)=O |r|
Show InChI InChI=1S/C35H42BrN5O4/c1-22(2)33(41-32(43)17-14-25-20-38-28-11-7-6-10-27(25)28)35(45)40-29(18-23-8-4-3-5-9-23)31(42)21-39-30(34(37)44)19-24-12-15-26(36)16-13-24/h3-13,15-16,20,22,29-31,33,38-39,42H,14,17-19,21H2,1-2H3,(H2,37,44)(H,40,45)(H,41,43)/t29-,30-,31-,33-/m0/s1
NCI pathway
Reactome pathway
500n/an/an/an/an/an/an/an/a
Uppsala University
Assay Description
Enzyme activities were assayed by monitoring the hydrolysis of substrate in the presence or absence of inhibitor compounds. The hydrolysis was record...
J Comb Chem 5: 456-64 (2003)
Article DOI: 10.1021/cc0301014
BindingDB Entry DOI: 10.7270/Q27S7KZZ