BDBM80858 3-(2-Chloro-phenyl)-4,5-dihydro-isoxazole-5-carboxylic acid (3-cyano-5,6-dihydro-4H-cyclopenta[b]thiophen-2-yl)-amide::3-(2-chlorophenyl)-N-(3-cyano-5,6-dihydro-4H-cyclopenta[b]thiophen-2-yl)-2-isoxazoline-5-carboxamide::3-(2-chlorophenyl)-N-(3-cyano-5,6-dihydro-4H-cyclopenta[b]thiophen-2-yl)-4,5-dihydro-1,2-oxazole-5-carboxamide::3-(2-chlorophenyl)-N-(3-cyano-5,6-dihydro-4H-cyclopenta[b]thiophen-2-yl)-4,5-dihydroisoxazole-5-carboxamide::MLS000558791::SMR000178650::cid_3158094
SMILES: Clc1ccccc1C1=NOC(C1)C(=O)Nc1sc2CCCc2c1C#N
InChI Key: InChIKey=ZZMPXIQXIMGMMD-UHFFFAOYSA-N
Data: 2 IC50
Activity Spreadsheet -- Enzyme Inhibition Constant Data from BindingDB
Found 2 hits for monomerid = 80858
Trg + Lig
Ki
nM
ΔG°
kcal/mole
IC50
nM
Kd
nM
EC50/IC50
nM
koff
s-1
kon
M-1s-1
pHTemp
°C
Phospholipase A2
(Homo sapiens (Human))
BDBM80858
(3-(2-Chloro-phenyl)-4,5-dihydro-isoxazole-5-carbox...)
Show SMILES Clc1ccccc1C1=NOC(C1)C(=O)Nc1sc2CCCc2c1C#N |t:8|
Show InChI InChI=1S/C18H14ClN3O2S/c19-13-6-2-1-4-11(13)14-8-15(24-22-14)17(23)21-18-12(9-20)10-5-3-7-16(10)25-18/h1-2,4,6,15H,3,5,7-8H2,(H,21,23)
Reactome pathway
PCBioAssay
n/an/a 3.48E+3n/an/an/an/an/an/a
Burnham Center for Chemical Genomics
Curated by PubChem BioAssay
Assay Description
Data Source: Sanford-Burnham Center for Chemical Genomics (SBCCG) Source Affiliation: Sanford-Burnham Medical Research Institute (SBMRI, San Diego, C...
PubChem Bioassay (2011)
BindingDB Entry DOI: 10.7270/Q26M35BC
cysteine protease ATG4B isoform a
(Homo sapiens (Human))
BDBM80858
(3-(2-Chloro-phenyl)-4,5-dihydro-isoxazole-5-carbox...)
Show SMILES Clc1ccccc1C1=NOC(C1)C(=O)Nc1sc2CCCc2c1C#N |t:8|
Show InChI InChI=1S/C18H14ClN3O2S/c19-13-6-2-1-4-11(13)14-8-15(24-22-14)17(23)21-18-12(9-20)10-5-3-7-16(10)25-18/h1-2,4,6,15H,3,5,7-8H2,(H,21,23)
PCBioAssay
n/an/a 4.36E+3n/an/an/an/an/an/a
Burnham Center for Chemical Genomics
Curated by PubChem BioAssay
Assay Description
Data Source: Sanford-Burnham Center for Chemical Genomics (SBCCG) Source Affiliation: Sanford-Burnham Medical Research Institute (SBMRI, San Diego, C...
PubChem Bioassay (2011)
BindingDB Entry DOI: 10.7270/Q2BZ64H1