BDBM8099 (2S)-N-[(2S,3S)-4-{[(1S)-1-carbamoyl-2-(4-phenylphenyl)ethyl]amino}-3-hydroxy-1-phenylbutan-2-yl]-3-methyl-2-[(2E)-3-(2,3,4,5,6-pentafluorophenyl)prop-2-enamido]butanamide::hydroxylethylamine scaffold 69::hydroxylethylamine scaffold 6{9}
SMILES: CC(C)[C@H](NC(=O)\C=C\c1c(F)c(F)c(F)c(F)c1F)C(=O)N[C@@H](Cc1ccccc1)[C@@H](O)CN[C@@H](Cc1ccc(cc1)-c1ccccc1)C(N)=O
InChI Key: InChIKey=PASKZJJQEQPWCN-NPPQHFDGSA-N
Data: 3 KI
Activity Spreadsheet -- Enzyme Inhibition Constant Data from BindingDB
Found 3 hits for monomerid = 8099
Trg + Lig
Ki
nM
ΔG°
kcal/mole
IC50
nM
Kd
nM
EC50/IC50
nM
koff
s-1
kon
M-1s-1
pHTemp
°C
Plasmepsin I
(Plasmodium falciparum)
BDBM8099
((2S)-N-[(2S,3S)-4-{[(1S)-1-carbamoyl-2-(4-phenylph...)
Show SMILES CC(C)[C@H](NC(=O)\C=C\c1c(F)c(F)c(F)c(F)c1F)C(=O)N[C@@H](Cc1ccccc1)[C@@H](O)CN[C@@H](Cc1ccc(cc1)-c1ccccc1)C(N)=O |r|
Show InChI InChI=1S/C39H39F5N4O4/c1-22(2)37(48-31(50)18-17-27-32(40)34(42)36(44)35(43)33(27)41)39(52)47-28(19-23-9-5-3-6-10-23)30(49)21-46-29(38(45)51)20-24-13-15-26(16-14-24)25-11-7-4-8-12-25/h3-18,22,28-30,37,46,49H,19-21H2,1-2H3,(H2,45,51)(H,47,52)(H,48,50)/b18-17+/t28-,29-,30-,37-/m0/s1
2n/an/an/an/an/an/an/an/a
Uppsala University
Assay Description
Enzyme activities were assayed by monitoring the hydrolysis of substrate in the presence or absence of inhibitor compounds. The hydrolysis was record...
J Comb Chem 5: 456-64 (2003)
Article DOI: 10.1021/cc0301014
BindingDB Entry DOI: 10.7270/Q27S7KZZ
Plasmepsin II
(Plasmodium falciparum)
BDBM8099
((2S)-N-[(2S,3S)-4-{[(1S)-1-carbamoyl-2-(4-phenylph...)
Show SMILES CC(C)[C@H](NC(=O)\C=C\c1c(F)c(F)c(F)c(F)c1F)C(=O)N[C@@H](Cc1ccccc1)[C@@H](O)CN[C@@H](Cc1ccc(cc1)-c1ccccc1)C(N)=O |r|
Show InChI InChI=1S/C39H39F5N4O4/c1-22(2)37(48-31(50)18-17-27-32(40)34(42)36(44)35(43)33(27)41)39(52)47-28(19-23-9-5-3-6-10-23)30(49)21-46-29(38(45)51)20-24-13-15-26(16-14-24)25-11-7-4-8-12-25/h3-18,22,28-30,37,46,49H,19-21H2,1-2H3,(H2,45,51)(H,47,52)(H,48,50)/b18-17+/t28-,29-,30-,37-/m0/s1
120 -9.34n/an/an/an/an/a4.522
Uppsala University
Assay Description
Enzyme activities were assayed by monitoring the hydrolysis of substrate in the presence or absence of inhibitor compounds. The hydrolysis was record...
J Comb Chem 5: 456-64 (2003)
Article DOI: 10.1021/cc0301014
BindingDB Entry DOI: 10.7270/Q27S7KZZ
Cathepsin D
(Homo sapiens (Human))
BDBM8099
((2S)-N-[(2S,3S)-4-{[(1S)-1-carbamoyl-2-(4-phenylph...)
Show SMILES CC(C)[C@H](NC(=O)\C=C\c1c(F)c(F)c(F)c(F)c1F)C(=O)N[C@@H](Cc1ccccc1)[C@@H](O)CN[C@@H](Cc1ccc(cc1)-c1ccccc1)C(N)=O |r|
Show InChI InChI=1S/C39H39F5N4O4/c1-22(2)37(48-31(50)18-17-27-32(40)34(42)36(44)35(43)33(27)41)39(52)47-28(19-23-9-5-3-6-10-23)30(49)21-46-29(38(45)51)20-24-13-15-26(16-14-24)25-11-7-4-8-12-25/h3-18,22,28-30,37,46,49H,19-21H2,1-2H3,(H2,45,51)(H,47,52)(H,48,50)/b18-17+/t28-,29-,30-,37-/m0/s1
NCI pathway
Reactome pathway
1.40E+3n/an/an/an/an/an/an/an/a
Uppsala University
Assay Description
Enzyme activities were assayed by monitoring the hydrolysis of substrate in the presence or absence of inhibitor compounds. The hydrolysis was record...
J Comb Chem 5: 456-64 (2003)
Article DOI: 10.1021/cc0301014
BindingDB Entry DOI: 10.7270/Q27S7KZZ