null
SMILES: COC(=O)c1ccccc1NC=C1CCc2c(c(C)nn2-c2ccccn2)C1=O
InChI Key: InChIKey=VLTRNDAJMFGMMH-UHFFFAOYSA-N
Activity Spreadsheet -- Enzyme Inhibition Constant Data from BindingDB
Found 4 hits for monomerid = 81032
Trg + Lig
Ki
nM
ΔG°
kcal/mole
IC50
nM
Kd
nM
EC50/IC50
nM
koff
s-1
kon
M-1s-1
pHTemp
°C
Glucose-6-phosphate 1-dehydrogenase
(Homo sapiens (Human))
BDBM81032
(2-[[(E)-[3-methyl-4-oxo-1-(2-pyridinyl)-6,7-dihydr...)
Show SMILES COC(=O)c1ccccc1NC=C1CCc2c(c(C)nn2-c2ccccn2)C1=O |w:11.11|
Show InChI InChI=1S/C22H20N4O3/c1-14-20-18(26(25-14)19-9-5-6-12-23-19)11-10-15(21(20)27)13-24-17-8-4-3-7-16(17)22(28)29-2/h3-9,12-13,24H,10-11H2,1-2H3
PCBioAssay
n/an/a>8.00E+4n/an/an/an/an/an/a
Burnham Center for Chemical Genomics
Curated by PubChem BioAssay
Assay Description
Data Source: Sanford-Burnham Center for Chemical Genomics (SBCCG) Source Affiliation: Sanford-Burnham Medical Research Institute (SBMRI, San Diego CA...
PubChem Bioassay (2011)
BindingDB Entry DOI: 10.7270/Q2V12389
Glucose-6-phosphate dehydrogenase-6-phosphogluconolactonase
(Plasmodium falciparum 3D7)
BDBM81032
(2-[[(E)-[3-methyl-4-oxo-1-(2-pyridinyl)-6,7-dihydr...)
Show SMILES COC(=O)c1ccccc1NC=C1CCc2c(c(C)nn2-c2ccccn2)C1=O |w:11.11|
Show InChI InChI=1S/C22H20N4O3/c1-14-20-18(26(25-14)19-9-5-6-12-23-19)11-10-15(21(20)27)13-24-17-8-4-3-7-16(17)22(28)29-2/h3-9,12-13,24H,10-11H2,1-2H3
PCBioAssay
n/an/a 5.20E+4n/an/an/an/an/an/a
Burnham Center for Chemical Genomics
Curated by PubChem BioAssay
Assay Description
Data Source: Sanford-Burnham Center for Chemical Genomics (SBCCG) Source Affiliation: Sanford-Burnham Medical Research Institute (SBMRI, San Diego CA...
PubChem Bioassay (2011)
BindingDB Entry DOI: 10.7270/Q23T9FQ1
Glucose-6-phosphate dehydrogenase-6-phosphogluconolactonase
(Plasmodium falciparum 3D7)
BDBM81032
(2-[[(E)-[3-methyl-4-oxo-1-(2-pyridinyl)-6,7-dihydr...)
Show SMILES COC(=O)c1ccccc1NC=C1CCc2c(c(C)nn2-c2ccccn2)C1=O |w:11.11|
Show InChI InChI=1S/C22H20N4O3/c1-14-20-18(26(25-14)19-9-5-6-12-23-19)11-10-15(21(20)27)13-24-17-8-4-3-7-16(17)22(28)29-2/h3-9,12-13,24H,10-11H2,1-2H3
PCBioAssay
n/an/a>8.00E+4n/an/an/an/an/an/a
Burnham Center for Chemical Genomics
Curated by PubChem BioAssay
Assay Description
Data Source: Sanford-Burnham Center for Chemical Genomics (SBCCG) Source Affiliation: Sanford-Burnham Medical Research Institute (SBMRI, San Diego CA...
PubChem Bioassay (2011)
BindingDB Entry DOI: 10.7270/Q27H1H3W
Glucose-6-phosphate dehydrogenase-6-phosphogluconolactonase
(Plasmodium falciparum 3D7)
BDBM81032
(2-[[(E)-[3-methyl-4-oxo-1-(2-pyridinyl)-6,7-dihydr...)
Show SMILES COC(=O)c1ccccc1NC=C1CCc2c(c(C)nn2-c2ccccn2)C1=O |w:11.11|
Show InChI InChI=1S/C22H20N4O3/c1-14-20-18(26(25-14)19-9-5-6-12-23-19)11-10-15(21(20)27)13-24-17-8-4-3-7-16(17)22(28)29-2/h3-9,12-13,24H,10-11H2,1-2H3
PCBioAssay
n/an/a 3.66E+3n/an/an/an/an/an/a
Burnham Center for Chemical Genomics
Curated by PubChem BioAssay
Assay Description
Data Source: Sanford-Burnham Center for Chemical Genomics (SBCCG) Source Affiliation: Sanford-Burnham Medical Research Institute (SBMRI, San Diego CA...
PubChem Bioassay (2011)
BindingDB Entry DOI: 10.7270/Q2ZS2TZG