BDBM8137 N-(3,4-difluorophenyl)-4-{pyrazolo[1,5-a]pyridazin-3-yl}pyrimidin-2-amine::pyrazolo[1,5-b]pyridazine deriv. 28
SMILES: Fc1ccc(Nc2nccc(n2)-c2cnn3ncccc23)cc1F
InChI Key: InChIKey=BLZGDFUGFILBJG-UHFFFAOYSA-N
Data: 4 IC50
Activity Spreadsheet -- Enzyme Inhibition Constant Data from BindingDB
Found 4 hits for monomerid = 8137
Trg + Lig
Ki
nM
ΔG°
kcal/mole
IC50
nM
Kd
nM
EC50/IC50
nM
koff
s-1
kon
M-1s-1
pHTemp
°C
Cyclin-Dependent Kinase 2 (CDK2)
(Homo sapiens (Human))
BDBM8137
(N-(3,4-difluorophenyl)-4-{pyrazolo[1,5-a]pyridazin...)
Show SMILES Fc1ccc(Nc2nccc(n2)-c2cnn3ncccc23)cc1F
Show InChI InChI=1S/C16H10F2N6/c17-12-4-3-10(8-13(12)18)22-16-19-7-5-14(23-16)11-9-21-24-15(11)2-1-6-20-24/h1-9H,(H,19,22,23)
NCI pathway
Reactome pathway
n/an/a 2n/an/an/an/a7.222
GlaxoSmithKline
Assay Description
The biochemical activity of compounds was determined by incubation with specific enzyme and substrate in the presence 2.5 uM ATP/ [gamma-32P] ATP. Af...
J Med Chem 47: 4716-30 (2004)
Article DOI: 10.1021/jm040063i
BindingDB Entry DOI: 10.7270/Q2VM49HJ
Cyclin-dependent kinase 2
(Homo sapiens (Human))
BDBM8137
(N-(3,4-difluorophenyl)-4-{pyrazolo[1,5-a]pyridazin...)
Show SMILES Fc1ccc(Nc2nccc(n2)-c2cnn3ncccc23)cc1F
Show InChI InChI=1S/C16H10F2N6/c17-12-4-3-10(8-13(12)18)22-16-19-7-5-14(23-16)11-9-21-24-15(11)2-1-6-20-24/h1-9H,(H,19,22,23)
NCI pathway
Reactome pathway
n/an/a 2n/an/an/an/an/an/a
Northeastern University
Curated by ChEMBL
Assay Description
Inhibition of human CDK2 using biotinylated-aminohexyl-Ala-Ala-Ala-Lys-Arg-Arg-Glu-Ile-Leu-Ser-Arg-Arg-Pro-Ser(PO3)-Tyr-Arg-amide as substrate after ...
J Med Chem 63: 756-783 (2020)
Article DOI: 10.1021/acs.jmedchem.9b01741
Glycogen synthase kinase-3 beta
(Homo sapiens (Human))
BDBM8137
(N-(3,4-difluorophenyl)-4-{pyrazolo[1,5-a]pyridazin...)
Show SMILES Fc1ccc(Nc2nccc(n2)-c2cnn3ncccc23)cc1F
Show InChI InChI=1S/C16H10F2N6/c17-12-4-3-10(8-13(12)18)22-16-19-7-5-14(23-16)11-9-21-24-15(11)2-1-6-20-24/h1-9H,(H,19,22,23)
NCI pathway
Reactome pathway
n/an/a 10n/an/an/an/an/an/a
Northeastern University
Curated by ChEMBL
Assay Description
Inhibition of human GSK3beta using biotinylated-aminohexyl-Ala-Ala-Ala-Lys-Arg-Arg-Glu-Ile-Leu-Ser-Arg-Arg-Pro-Ser(PO3)-Tyr-Arg-amide as substrate af...
J Med Chem 63: 756-783 (2020)
Article DOI: 10.1021/acs.jmedchem.9b01741
Glycogen synthase kinase-3 beta
(Homo sapiens (Human))
BDBM8137
(N-(3,4-difluorophenyl)-4-{pyrazolo[1,5-a]pyridazin...)
Show SMILES Fc1ccc(Nc2nccc(n2)-c2cnn3ncccc23)cc1F
Show InChI InChI=1S/C16H10F2N6/c17-12-4-3-10(8-13(12)18)22-16-19-7-5-14(23-16)11-9-21-24-15(11)2-1-6-20-24/h1-9H,(H,19,22,23)
NCI pathway
Reactome pathway
n/an/a 10n/an/an/an/an/an/a
GlaxoSmithKline
Assay Description
The biochemical activity of compounds was determined by incubation with specific enzyme and substrate in the presence 2.5 uM ATP/ [gamma-32P] ATP. Af...
J Med Chem 47: 4716-30 (2004)
Article DOI: 10.1021/jm040063i
BindingDB Entry DOI: 10.7270/Q2VM49HJ