BDBM81384 Oxyquinoline, D2, #3
SMILES: COc1ccc(cc1OC)C(Nc1ccccn1)c1ccc2ccc(C)nc2c1O
InChI Key: InChIKey=LOYXKFMCNYZVQD-UHFFFAOYSA-N
Data: 2 IC50
Activity Spreadsheet -- Enzyme Inhibition Constant Data from BindingDB
Found 2 hits for monomerid = 81384
Trg + Lig
Ki
nM
ΔG°
kcal/mole
IC50
nM
Kd
nM
EC50/IC50
nM
koff
s-1
kon
M-1s-1
pHTemp
°C
Botulinum neurotoxin type A
(Clostridium botulinum)
BDBM81384
(Oxyquinoline, D2, #3)
Show SMILES COc1ccc(cc1OC)C(Nc1ccccn1)c1ccc2ccc(C)nc2c1O
Show InChI InChI=1S/C24H23N3O3/c1-15-7-8-16-9-11-18(24(28)23(16)26-15)22(27-21-6-4-5-13-25-21)17-10-12-19(29-2)20(14-17)30-3/h4-14,22,28H,1-3H3,(H,25,27)
NCI pathway
Reactome pathway
n/an/a 3.00E+3n/an/an/an/an/an/a
The Scripps Research Institute
Curated by ChEMBL
Assay Description
Inhibition of Clostridium botulinum BoNT/A LC expressed in Escherichia coli assessed as cleavage of SNAPtide preincubated for 5 mins followed by SNAP...
J Med Chem 57: 669-76 (2014)
Article DOI: 10.1021/jm4012164
BindingDB Entry DOI: 10.7270/Q2GH9KDZ
Hypoxia-inducible factor 1-alpha
(Homo sapiens (Human))
BDBM81384
(Oxyquinoline, D2, #3)
Show SMILES COc1ccc(cc1OC)C(Nc1ccccn1)c1ccc2ccc(C)nc2c1O
Show InChI InChI=1S/C24H23N3O3/c1-15-7-8-16-9-11-18(24(28)23(16)26-15)22(27-21-6-4-5-13-25-21)17-10-12-19(29-2)20(14-17)30-3/h4-14,22,28H,1-3H3,(H,25,27)
Reactome pathway
n/an/a 1.20E+4n/an/an/an/an/an/a
Weill Medical College of Cornell University
Assay Description
The predication of no specific interaction between enzyme and iron-binding inhibitors but the Enzyme inhibition constants (IC50s)will change in paral...
Chem Biol 17: 380-91 (2010)
Article DOI: 10.1016/j.chembiol.2010.03.008
BindingDB Entry DOI: 10.7270/Q20K271K