BDBM81501 Argifin-Derived Fragments, 3
SMILES: CCCN=C(N)NC(=O)NC
InChI Key: InChIKey=FWWNOPUCHFTIHG-UHFFFAOYSA-N
Data: 1 IC50
Activity Spreadsheet -- Enzyme Inhibition Constant Data from BindingDB
Found 1 hit for monomerid = 81501
Trg + Lig
Ki
nM
ΔG°
kcal/mole
IC50
nM
Kd
nM
EC50/IC50
nM
koff
s-1
kon
M-1s-1
pHTemp
°C
Chitinase (chiA1)
(Neosartorya fumigata (Aspergillus fumigatus))
BDBM81501
(Argifin-Derived Fragments, 3)
Show SMILES CCCN=C(N)NC(=O)NC |w:3.2|
Show InChI InChI=1S/C6H14N4O/c1-3-4-9-5(7)10-6(11)8-2/h3-4H2,1-2H3,(H4,7,8,9,10,11)
n/an/a 6.20E+4n/an/an/an/a5.537
University of Dundee
Assay Description
Enzyme inhibition assay using chitinase A1 from aspergillus fumigatus.
Chem Biol 17: 1275-81 (2010)
Article DOI: 10.1016/j.chembiol.2010.07.018
BindingDB Entry DOI: 10.7270/Q2JD4V85