BDBM81692 4-Substituted Pyrrolidine Ring, 14
SMILES: NS(=O)(=O)c1ccccc1-c1ccc(NC(=O)[C@H]2CC(O)CN2C(=O)Nc2ccc(Cl)cc2)c(F)c1
InChI Key: InChIKey=FOTQXLYFKKVZMB-FBLFFUNLSA-N
Data: 1 IC50
Activity Spreadsheet -- Enzyme Inhibition Constant Data from BindingDB
Found 1 hit for monomerid = 81692
Trg + Lig
Ki
nM
ΔG°
kcal/mole
IC50
nM
Kd
nM
EC50/IC50
nM
koff
s-1
kon
M-1s-1
pHTemp
°C
Coagulation factor X
(Homo sapiens (Human))
BDBM81692
(4-Substituted Pyrrolidine Ring, 14)
Show SMILES NS(=O)(=O)c1ccccc1-c1ccc(NC(=O)[C@H]2CC(O)CN2C(=O)Nc2ccc(Cl)cc2)c(F)c1 |r|
Show InChI InChI=1S/C24H22ClFN4O5S/c25-15-6-8-16(9-7-15)28-24(33)30-13-17(31)12-21(30)23(32)29-20-10-5-14(11-19(20)26)18-3-1-2-4-22(18)36(27,34)35/h1-11,17,21,31H,12-13H2,(H,28,33)(H,29,32)(H2,27,34,35)/t17?,21-/m1/s1
Reactome pathway
n/an/a 0.75n/an/an/an/an/an/a
Pfizer Global Research and Development,
Assay Description
FXa inhibition were determined by using an inhibition assay.
Chem Biol Drug Des 69: 444-50 (2007)
Article DOI: 10.1111/j.1747-0285.2007.00520.x
BindingDB Entry DOI: 10.7270/Q2PZ5799