BDBM81699 4-Substituted Pyrrolidine Ring, 36
SMILES: CS(=O)(=O)c1ccccc1-c1ccc(NC(=O)[C@H]2CC(O)CN2C(=O)Nc2ccc(F)cc2)c(F)c1
InChI Key: InChIKey=PDEJQZAMNJMRAN-LMNIDFBRSA-N
Data: 1 IC50
Activity Spreadsheet -- Enzyme Inhibition Constant Data from BindingDB
Found 1 hit for monomerid = 81699
Trg + Lig
Ki
nM
ΔG°
kcal/mole
IC50
nM
Kd
nM
EC50/IC50
nM
koff
s-1
kon
M-1s-1
pHTemp
°C
Coagulation factor X
(Homo sapiens (Human))
BDBM81699
(4-Substituted Pyrrolidine Ring, 36)
Show SMILES CS(=O)(=O)c1ccccc1-c1ccc(NC(=O)[C@H]2CC(O)CN2C(=O)Nc2ccc(F)cc2)c(F)c1 |r|
Show InChI InChI=1S/C25H23F2N3O5S/c1-36(34,35)23-5-3-2-4-19(23)15-6-11-21(20(27)12-15)29-24(32)22-13-18(31)14-30(22)25(33)28-17-9-7-16(26)8-10-17/h2-12,18,22,31H,13-14H2,1H3,(H,28,33)(H,29,32)/t18?,22-/m1/s1
Reactome pathway
n/an/a 7.60n/an/an/an/an/an/a
Pfizer Global Research and Development,
Assay Description
FXa inhibition were determined by using an inhibition assay.
Chem Biol Drug Des 69: 444-50 (2007)
Article DOI: 10.1111/j.1747-0285.2007.00520.x
BindingDB Entry DOI: 10.7270/Q2PZ5799