BDBM8171 N-(2,3-dihydro-1,4-benzodioxin-6-yl)-4-{2-phenylpyrazolo[1,5-a]pyridazin-3-yl}pyrimidin-2-amine::pyrazolo[1,5-b]pyridazine deriv. 62
SMILES: C1COc2cc(Nc3nccc(n3)-c3c(nn4ncccc34)-c3ccccc3)ccc2O1
InChI Key: InChIKey=OOFFIMNOURWPHS-UHFFFAOYSA-N
Data: 1 KI  2 IC50
Activity Spreadsheet -- Enzyme Inhibition Constant Data from BindingDB
Found 2 hits for monomerid = 8171
Trg + Lig
Ki
nM
ΔG°
kcal/mole
IC50
nM
Kd
nM
EC50/IC50
nM
koff
s-1
kon
M-1s-1
pHTemp
°C
Glycogen synthase kinase-3 beta
(Homo sapiens (Human))
BDBM8171
(N-(2,3-dihydro-1,4-benzodioxin-6-yl)-4-{2-phenylpy...)
Show SMILES C1COc2cc(Nc3nccc(n3)-c3c(nn4ncccc34)-c3ccccc3)ccc2O1
Show InChI InChI=1S/C24H18N6O2/c1-2-5-16(6-3-1)23-22(19-7-4-11-26-30(19)29-23)18-10-12-25-24(28-18)27-17-8-9-20-21(15-17)32-14-13-31-20/h1-12,15H,13-14H2,(H,25,27,28)
NCI pathway
Reactome pathway
2n/a<10n/an/an/an/an/an/a
GlaxoSmithKline
Assay Description
The biochemical activity of compounds was determined by incubation with specific enzyme and substrate in the presence 2.5 uM ATP/ [gamma-32P] ATP. Af...
J Med Chem 47: 4716-30 (2004)
Article DOI: 10.1021/jm040063i
BindingDB Entry DOI: 10.7270/Q2VM49HJ
Cyclin-Dependent Kinase 2 (CDK2)
(Homo sapiens (Human))
BDBM8171
(N-(2,3-dihydro-1,4-benzodioxin-6-yl)-4-{2-phenylpy...)
Show SMILES C1COc2cc(Nc3nccc(n3)-c3c(nn4ncccc34)-c3ccccc3)ccc2O1
Show InChI InChI=1S/C24H18N6O2/c1-2-5-16(6-3-1)23-22(19-7-4-11-26-30(19)29-23)18-10-12-25-24(28-18)27-17-8-9-20-21(15-17)32-14-13-31-20/h1-12,15H,13-14H2,(H,25,27,28)
NCI pathway
Reactome pathway
n/an/a>2.00E+4n/an/an/an/an/an/a
GlaxoSmithKline
Assay Description
The biochemical activity of compounds was determined by incubation with specific enzyme and substrate in the presence 2.5 uM ATP/ [gamma-32P] ATP. Af...
J Med Chem 47: 4716-30 (2004)
Article DOI: 10.1021/jm040063i
BindingDB Entry DOI: 10.7270/Q2VM49HJ