BDBM81736 PPY-C
SMILES: COc1ccccc1-c1c[nH]c2ncc(cc12)-c1cccc(NC(C)=O)c1
InChI Key: InChIKey=BLZJCDJMIBXBBX-UHFFFAOYSA-N
Data: 2 IC50
Activity Spreadsheet -- Enzyme Inhibition Constant Data from BindingDB
Found 2 hits for monomerid = 81736
Trg + Lig
Ki
nM
ΔG°
kcal/mole
IC50
nM
Kd
nM
EC50/IC50
nM
koff
s-1
kon
M-1s-1
pHTemp
°C
ABL Mutant (T315I)
(Homo sapiens (Human))
BDBM81736
(PPY-C)
Show SMILES COc1ccccc1-c1c[nH]c2ncc(cc12)-c1cccc(NC(C)=O)c1
Show InChI InChI=1S/C22H19N3O2/c1-14(26)25-17-7-5-6-15(10-17)16-11-19-20(13-24-22(19)23-12-16)18-8-3-4-9-21(18)27-2/h3-13H,1-2H3,(H,23,24)(H,25,26)
n/an/a 41n/an/an/an/a7.425
ARIAD Pharmaceuticals Inc
Assay Description
Inhibition of wild-type Abl and Abl T315I kinase activity was measured in a homogeneous time-resolved fluorescence resonance energy transfer (TR-FRET...
Chem Biol Drug Des 70: 171-81 (2007)
Article DOI: 10.1111/j.1747-0285.2007.00556.x
BindingDB Entry DOI: 10.7270/Q228063T
Tyrosine-protein kinase ABL1
(Homo sapiens (Human))
BDBM81736
(PPY-C)
Show SMILES COc1ccccc1-c1c[nH]c2ncc(cc12)-c1cccc(NC(C)=O)c1
Show InChI InChI=1S/C22H19N3O2/c1-14(26)25-17-7-5-6-15(10-17)16-11-19-20(13-24-22(19)23-12-16)18-8-3-4-9-21(18)27-2/h3-13H,1-2H3,(H,23,24)(H,25,26)
Reactome pathway
n/an/a 110n/an/an/an/a7.425
ARIAD Pharmaceuticals Inc
Assay Description
Inhibition of wild-type Abl and Abl T315I kinase activity was measured in a homogeneous time-resolved fluorescence resonance energy transfer (TR-FRET...
Chem Biol Drug Des 70: 171-81 (2007)
Article DOI: 10.1111/j.1747-0285.2007.00556.x
BindingDB Entry DOI: 10.7270/Q228063T