BDBM81829 Bipiperidinyl carboxylic acid amide, 2
SMILES: COc1ccc(NC(=O)N2CCC(CC2)N2CCCC(C2)C(=O)N2CCN(CC2)c2ccccc2C)c(C)c1
InChI Key: InChIKey=DDBQYBZMKQDLNZ-UHFFFAOYSA-N
Data: 1 IC50
Activity Spreadsheet -- Enzyme Inhibition Constant Data from BindingDB
Found 1 hit for monomerid = 81829
Trg + Lig
Ki
nM
ΔG°
kcal/mole
IC50
nM
Kd
nM
EC50/IC50
nM
koff
s-1
kon
M-1s-1
pHTemp
°C
C-C chemokine receptor type 4 (CCR4)
(Homo sapiens (Human))
BDBM81829
(Bipiperidinyl carboxylic acid amide, 2)
Show SMILES COc1ccc(NC(=O)N2CCC(CC2)N2CCCC(C2)C(=O)N2CCN(CC2)c2ccccc2C)c(C)c1
Show InChI InChI=1S/C31H43N5O3/c1-23-7-4-5-9-29(23)33-17-19-34(20-18-33)30(37)25-8-6-14-36(22-25)26-12-15-35(16-13-26)31(38)32-28-11-10-27(39-3)21-24(28)2/h4-5,7,9-11,21,25-26H,6,8,12-20,22H2,1-3H3,(H,32,38)
n/an/a 5.90E+3n/an/an/an/an/an/a
Pfizer
Assay Description
Cell-based assay for CCR4 was developed to screen small-molecule compound library using a Fluorometric Imaging Plate Reader (FlIPR) assay to identify...
Chem Biol Drug Des 70: 268-72 (2007)
Article DOI: 10.1111/j.1747-0285.2007.00551.x
BindingDB Entry DOI: 10.7270/Q2K35S44