BDBM81833 Bipiperidinyl carboxylic acid amide, 5
SMILES: Cc1cccc(n1)N1CCN(CC1)C(=O)C1CCCN(C1)C1CCN(CC1)C(=O)NC(C)(C)C
InChI Key: InChIKey=FLTCTBLEAPHJHW-UHFFFAOYSA-N
Data: 1 IC50
Activity Spreadsheet -- Enzyme Inhibition Constant Data from BindingDB
Found 1 hit for monomerid = 81833
Trg + Lig
Ki
nM
ΔG°
kcal/mole
IC50
nM
Kd
nM
EC50/IC50
nM
koff
s-1
kon
M-1s-1
pHTemp
°C
C-C chemokine receptor type 4 (CCR4)
(Homo sapiens (Human))
BDBM81833
(Bipiperidinyl carboxylic acid amide, 5)
Show SMILES Cc1cccc(n1)N1CCN(CC1)C(=O)C1CCCN(C1)C1CCN(CC1)C(=O)NC(C)(C)C
Show InChI InChI=1S/C26H42N6O2/c1-20-7-5-9-23(27-20)29-15-17-30(18-16-29)24(33)21-8-6-12-32(19-21)22-10-13-31(14-11-22)25(34)28-26(2,3)4/h5,7,9,21-22H,6,8,10-19H2,1-4H3,(H,28,34)
n/an/a 7.40E+3n/an/an/an/an/an/a
Pfizer
Assay Description
Cell-based assay for CCR4 was developed to screen small-molecule compound library using a Fluorometric Imaging Plate Reader (FlIPR) assay to identify...
Chem Biol Drug Des 70: 268-72 (2007)
Article DOI: 10.1111/j.1747-0285.2007.00551.x
BindingDB Entry DOI: 10.7270/Q2K35S44