BDBM81836 Bipiperidinyl carboxylic acid amide, 9
SMILES: CCCCOC(=O)NC(=O)N1CCC(CC1)N1CCCC(C1)C(=O)N1CCN(CC1)c1cccc(C)n1
InChI Key: InChIKey=PAVLSXDQVQGJHT-UHFFFAOYSA-N
Data: 1 IC50
Activity Spreadsheet -- Enzyme Inhibition Constant Data from BindingDB
Found 1 hit for monomerid = 81836
Trg + Lig
Ki
nM
ΔG°
kcal/mole
IC50
nM
Kd
nM
EC50/IC50
nM
koff
s-1
kon
M-1s-1
pHTemp
°C
C-C chemokine receptor type 4 (CCR4)
(Homo sapiens (Human))
BDBM81836
(Bipiperidinyl carboxylic acid amide, 9)
Show SMILES CCCCOC(=O)NC(=O)N1CCC(CC1)N1CCCC(C1)C(=O)N1CCN(CC1)c1cccc(C)n1
Show InChI InChI=1S/C27H42N6O4/c1-3-4-19-37-27(36)29-26(35)32-13-10-23(11-14-32)33-12-6-8-22(20-33)25(34)31-17-15-30(16-18-31)24-9-5-7-21(2)28-24/h5,7,9,22-23H,3-4,6,8,10-20H2,1-2H3,(H,29,35,36)
n/an/a 3.50E+3n/an/an/an/an/an/a
Pfizer
Assay Description
Cell-based assay for CCR4 was developed to screen small-molecule compound library using a Fluorometric Imaging Plate Reader (FlIPR) assay to identify...
Chem Biol Drug Des 70: 268-72 (2007)
Article DOI: 10.1111/j.1747-0285.2007.00551.x
BindingDB Entry DOI: 10.7270/Q2K35S44