BDBM81842 Bipiperidinyl carboxylic acid amide, 14
SMILES: Cc1cccc(CNC(=O)N2CCC(CC2)N2CCCC(C2)C(=O)N2CCN(CC2)c2ccccc2Cl)c1
InChI Key: InChIKey=QFSXGXXKZBEJGV-UHFFFAOYSA-N
Data: 1 IC50
Activity Spreadsheet -- Enzyme Inhibition Constant Data from BindingDB
Found 1 hit for monomerid = 81842
Trg + Lig
Ki
nM
ΔG°
kcal/mole
IC50
nM
Kd
nM
EC50/IC50
nM
koff
s-1
kon
M-1s-1
pHTemp
°C
C-C chemokine receptor type 4 (CCR4)
(Homo sapiens (Human))
BDBM81842
(Bipiperidinyl carboxylic acid amide, 14)
Show SMILES Cc1cccc(CNC(=O)N2CCC(CC2)N2CCCC(C2)C(=O)N2CCN(CC2)c2ccccc2Cl)c1
Show InChI InChI=1S/C30H40ClN5O2/c1-23-6-4-7-24(20-23)21-32-30(38)35-14-11-26(12-15-35)36-13-5-8-25(22-36)29(37)34-18-16-33(17-19-34)28-10-3-2-9-27(28)31/h2-4,6-7,9-10,20,25-26H,5,8,11-19,21-22H2,1H3,(H,32,38)
n/an/a 5.20E+3n/an/an/an/an/an/a
Pfizer
Assay Description
Cell-based assay for CCR4 was developed to screen small-molecule compound library using a Fluorometric Imaging Plate Reader (FlIPR) assay to identify...
Chem Biol Drug Des 70: 268-72 (2007)
Article DOI: 10.1111/j.1747-0285.2007.00551.x
BindingDB Entry DOI: 10.7270/Q2K35S44