BDBM81848 Bipiperidinyl carboxylic acid amide, 20
SMILES: CCCCOc1ccc(NC(=O)N2CCC(CC2)N2CCCC(C2)C(=O)N2CCN(CC2)c2cccc(C)n2)cc1
InChI Key: InChIKey=TUGVNLPVMXMGEN-UHFFFAOYSA-N
Data: 1 IC50
Activity Spreadsheet -- Enzyme Inhibition Constant Data from BindingDB
Found 1 hit for monomerid = 81848
Trg + Lig
Ki
nM
ΔG°
kcal/mole
IC50
nM
Kd
nM
EC50/IC50
nM
koff
s-1
kon
M-1s-1
pHTemp
°C
C-C chemokine receptor type 4 (CCR4)
(Homo sapiens (Human))
BDBM81848
(Bipiperidinyl carboxylic acid amide, 20)
Show SMILES CCCCOc1ccc(NC(=O)N2CCC(CC2)N2CCCC(C2)C(=O)N2CCN(CC2)c2cccc(C)n2)cc1
Show InChI InChI=1S/C32H46N6O3/c1-3-4-23-41-29-12-10-27(11-13-29)34-32(40)37-17-14-28(15-18-37)38-16-6-8-26(24-38)31(39)36-21-19-35(20-22-36)30-9-5-7-25(2)33-30/h5,7,9-13,26,28H,3-4,6,8,14-24H2,1-2H3,(H,34,40)
n/an/a 200n/an/an/an/an/an/a
Pfizer
Assay Description
Cell-based assay for CCR4 was developed to screen small-molecule compound library using a Fluorometric Imaging Plate Reader (FlIPR) assay to identify...
Chem Biol Drug Des 70: 268-72 (2007)
Article DOI: 10.1111/j.1747-0285.2007.00551.x
BindingDB Entry DOI: 10.7270/Q2K35S44