BDBM81912 DC23::Resorcinol analog, 1
SMILES: Oc1ccc(-c2n[nH]c(=S)n2-c2cccc3ccccc23)c(O)c1
InChI Key: InChIKey=ISNBTODJGDBLAZ-UHFFFAOYSA-N
Data: 3 IC50  2 Kd
Activity Spreadsheet -- Enzyme Inhibition Constant Data from BindingDB
Found 5 hits for monomerid = 81912
Trg + Lig
Ki
nM
ΔG°
kcal/mole
IC50
nM
Kd
nM
EC50/IC50
nM
koff
s-1
kon
M-1s-1
pHTemp
°C
Heat shock protein HSP 90-alpha
(Homo sapiens (Human))
BDBM81912
(DC23 | Resorcinol analog, 1)
Show SMILES Oc1ccc(-c2n[nH]c(=S)n2-c2cccc3ccccc23)c(O)c1 |(.68,.63,;2.01,1.4,;2.01,2.94,;3.35,3.71,;4.68,2.94,;5.88,3.91,;7.36,3.51,;8.2,4.8,;7.23,6,;7.63,7.48,;5.8,5.45,;4.46,6.22,;3.13,5.44,;1.79,6.21,;1.79,7.76,;3.13,8.53,;3.13,10.06,;4.46,10.84,;5.8,10.07,;5.8,8.52,;4.46,7.76,;4.68,1.4,;6.01,.63,;3.35,.63,)|
Show InChI InChI=1S/C18H13N3O2S/c22-12-8-9-14(16(23)10-12)17-19-20-18(24)21(17)15-7-3-5-11-4-1-2-6-13(11)15/h1-10,22-23H,(H,20,24)
NCI pathway
Reactome pathway
n/an/a 0.300n/an/an/an/a7.4n/a
Bayer Healthcare,
Assay Description
To assess the affinity of compounds binding to Hsp90, we measured their ability to compete with the binding of a fluorescent analog of GA (GM-Bodipy)...
Chem Biol Drug Des 74: 43-50 (2009)
Article DOI: 10.1111/j.1747-0285.2009.00833.x
BindingDB Entry DOI: 10.7270/Q2KW5DJW
[Pyruvate dehydrogenase (acetyl-transferring)] kinase isozyme 2, mitochondrial
(Homo sapiens (Human))
BDBM81912
(DC23 | Resorcinol analog, 1)
Show SMILES Oc1ccc(-c2n[nH]c(=S)n2-c2cccc3ccccc23)c(O)c1 |(.68,.63,;2.01,1.4,;2.01,2.94,;3.35,3.71,;4.68,2.94,;5.88,3.91,;7.36,3.51,;8.2,4.8,;7.23,6,;7.63,7.48,;5.8,5.45,;4.46,6.22,;3.13,5.44,;1.79,6.21,;1.79,7.76,;3.13,8.53,;3.13,10.06,;4.46,10.84,;5.8,10.07,;5.8,8.52,;4.46,7.76,;4.68,1.4,;6.01,.63,;3.35,.63,)|
Show InChI InChI=1S/C18H13N3O2S/c22-12-8-9-14(16(23)10-12)17-19-20-18(24)21(17)15-7-3-5-11-4-1-2-6-13(11)15/h1-10,22-23H,(H,20,24)
n/an/a 3.82E+3n/an/an/an/a7.525
University of Texas Southwestern Medical Center
Assay Description
To determine the IC50 for PDK inhibitors, a mixture containing 0.05-0.2 μM PDK, 6μM E1, with or without 0.5 μM of the PDC core E2/E3BP...
J Biol Chem 289: 4432-43 (2014)
Article DOI: 10.1074/jbc.M113.533885
BindingDB Entry DOI: 10.7270/Q2N58K7F
Heat-shock protein 90 (Hsp90)
(Homo sapiens (Human))
BDBM81912
(DC23 | Resorcinol analog, 1)
Show SMILES Oc1ccc(-c2n[nH]c(=S)n2-c2cccc3ccccc23)c(O)c1 |(.68,.63,;2.01,1.4,;2.01,2.94,;3.35,3.71,;4.68,2.94,;5.88,3.91,;7.36,3.51,;8.2,4.8,;7.23,6,;7.63,7.48,;5.8,5.45,;4.46,6.22,;3.13,5.44,;1.79,6.21,;1.79,7.76,;3.13,8.53,;3.13,10.06,;4.46,10.84,;5.8,10.07,;5.8,8.52,;4.46,7.76,;4.68,1.4,;6.01,.63,;3.35,.63,)|
Show InChI InChI=1S/C18H13N3O2S/c22-12-8-9-14(16(23)10-12)17-19-20-18(24)21(17)15-7-3-5-11-4-1-2-6-13(11)15/h1-10,22-23H,(H,20,24)
n/an/an/a 25n/an/an/a7.515
University of Texas Southwestern Medical Center
Assay Description
The PDK2 or Hsp90 N-terminal domain protein was dialyzed against 1 liter of thedialysis buffer containing 50 mM Tris-Cl, pH 7.5, 50 mM KCl, 1 mM MgCl...
J Biol Chem 289: 4432-43 (2014)
Article DOI: 10.1074/jbc.M113.533885
BindingDB Entry DOI: 10.7270/Q2N58K7F
[Pyruvate dehydrogenase (acetyl-transferring)] kinase isozyme 2, mitochondrial
(Homo sapiens (Human))
BDBM81912
(DC23 | Resorcinol analog, 1)
Show SMILES Oc1ccc(-c2n[nH]c(=S)n2-c2cccc3ccccc23)c(O)c1 |(.68,.63,;2.01,1.4,;2.01,2.94,;3.35,3.71,;4.68,2.94,;5.88,3.91,;7.36,3.51,;8.2,4.8,;7.23,6,;7.63,7.48,;5.8,5.45,;4.46,6.22,;3.13,5.44,;1.79,6.21,;1.79,7.76,;3.13,8.53,;3.13,10.06,;4.46,10.84,;5.8,10.07,;5.8,8.52,;4.46,7.76,;4.68,1.4,;6.01,.63,;3.35,.63,)|
Show InChI InChI=1S/C18H13N3O2S/c22-12-8-9-14(16(23)10-12)17-19-20-18(24)21(17)15-7-3-5-11-4-1-2-6-13(11)15/h1-10,22-23H,(H,20,24)
n/an/an/a 6.76E+3n/an/an/a7.515
University of Texas Southwestern Medical Center
Assay Description
The PDK2 or Hsp90 N-terminal domain protein was dialyzed against 1 liter of thedialysis buffer containing 50 mM Tris-Cl, pH 7.5, 50 mM KCl, 1 mM MgCl...
J Biol Chem 289: 4432-43 (2014)
Article DOI: 10.1074/jbc.M113.533885
BindingDB Entry DOI: 10.7270/Q2N58K7F
Pyruvate dehydrogenase kinase 4 (PDK4)
(Homo sapiens (Human))
BDBM81912
(DC23 | Resorcinol analog, 1)
Show SMILES Oc1ccc(-c2n[nH]c(=S)n2-c2cccc3ccccc23)c(O)c1 |(.68,.63,;2.01,1.4,;2.01,2.94,;3.35,3.71,;4.68,2.94,;5.88,3.91,;7.36,3.51,;8.2,4.8,;7.23,6,;7.63,7.48,;5.8,5.45,;4.46,6.22,;3.13,5.44,;1.79,6.21,;1.79,7.76,;3.13,8.53,;3.13,10.06,;4.46,10.84,;5.8,10.07,;5.8,8.52,;4.46,7.76,;4.68,1.4,;6.01,.63,;3.35,.63,)|
Show InChI InChI=1S/C18H13N3O2S/c22-12-8-9-14(16(23)10-12)17-19-20-18(24)21(17)15-7-3-5-11-4-1-2-6-13(11)15/h1-10,22-23H,(H,20,24)
n/an/a 280n/an/an/an/a7.525
University of Texas Southwestern Medical Center
Assay Description
To determine the IC50 for PDK inhibitors, a mixture containing 0.05-0.2 μM PDK, 6μM E1, with or without 0.5 μM of the PDC core E2/E3BP...
J Biol Chem 289: 4432-43 (2014)
Article DOI: 10.1074/jbc.M113.533885
BindingDB Entry DOI: 10.7270/Q2N58K7F