BDBM81923 p-Phenyldiazenyl derivative, 8
SMILES: CNS(=O)(=O)c1ccc(cc1)N=Nc1ccc(O)cc1
InChI Key: InChIKey=PCHMJOHUYPRWEV-UHFFFAOYSA-N
Data: 2 KI
Activity Spreadsheet -- Enzyme Inhibition Constant Data from BindingDB
Found 2 hits for monomerid = 81923
Trg + Lig
Ki
nM
ΔG°
kcal/mole
IC50
nM
Kd
nM
EC50/IC50
nM
koff
s-1
kon
M-1s-1
pHTemp
°C
Carbonic anhydrase 2
(Homo sapiens (Human))
BDBM81923
(p-Phenyldiazenyl derivative, 8)
Show SMILES CNS(=O)(=O)c1ccc(cc1)N=Nc1ccc(O)cc1 |w:11.11|
Show InChI InChI=1S/C13H13N3O3S/c1-14-20(18,19)13-8-4-11(5-9-13)16-15-10-2-6-12(17)7-3-10/h2-9,14,17H,1H3
Reactome pathway
277 -8.94n/an/an/an/an/a7.425
Universita degli Studi di Firenze
Assay Description
Carbonic anhydrase (CA) inhibition against hCA II and V11 with synthesized compounds 2-8.
Chem Biol Drug Des 74: 196-202 (2009)
Article DOI: 10.1111/j.1747-0285.2009.00842.x
BindingDB Entry DOI: 10.7270/Q2G44NS1
Carbonic anhydrase 7
(Homo sapiens (Human))
BDBM81923
(p-Phenyldiazenyl derivative, 8)
Show SMILES CNS(=O)(=O)c1ccc(cc1)N=Nc1ccc(O)cc1 |w:11.11|
Show InChI InChI=1S/C13H13N3O3S/c1-14-20(18,19)13-8-4-11(5-9-13)16-15-10-2-6-12(17)7-3-10/h2-9,14,17H,1H3
Reactome pathway
706 -8.39n/an/an/an/an/a7.425
Universita degli Studi di Firenze
Assay Description
Carbonic anhydrase (CA) inhibition against hCA II and V11 with synthesized compounds 2-8.
Chem Biol Drug Des 74: 196-202 (2009)
Article DOI: 10.1111/j.1747-0285.2009.00842.x
BindingDB Entry DOI: 10.7270/Q2G44NS1