BDBM82052 Ado-5'-ethylcarboxylate
SMILES: CCC(=O)OC[C@H]1O[C@H]([C@H](O)[C@@H]1O)n1cnc2c(N)ncnc12
InChI Key: InChIKey=HHBDDEZLXDKDHK-ZRFIDHNTSA-N
Data: 2 KI  1 IC50
Activity Spreadsheet -- Enzyme Inhibition Constant Data from BindingDB
Found 3 hits for monomerid = 82052
Trg + Lig
Ki
nM
ΔG°
kcal/mole
IC50
nM
Kd
nM
EC50/IC50
nM
koff
s-1
kon
M-1s-1
pHTemp
°C
Adenosine receptor A1
(Rattus norvegicus (rat))
BDBM82052
(Ado-5'-ethylcarboxylate)
Show SMILES CCC(=O)OC[C@H]1O[C@H]([C@H](O)[C@@H]1O)n1cnc2c(N)ncnc12 |r|
Show InChI InChI=1S/C13H17N5O5/c1-2-7(19)22-3-6-9(20)10(21)13(23-6)18-5-17-8-11(14)15-4-16-12(8)18/h4-6,9-10,13,20-21H,2-3H2,1H3,(H2,14,15,16)/t6-,9-,10-,13-/m1/s1
Reactome pathway
174n/an/an/an/an/an/an/an/a
Warner-Lambert/Parke-Davis Pharmaceutical Research
Curated by PDSP Ki Database
Mol Pharmacol 29: 331-46 (1986)
BindingDB Entry DOI: 10.7270/Q2MK6BDV
Adenosine Receptors A2a (A2a)
(Rattus norvegicus (rat))
BDBM82052
(Ado-5'-ethylcarboxylate)
Show SMILES CCC(=O)OC[C@H]1O[C@H]([C@H](O)[C@@H]1O)n1cnc2c(N)ncnc12 |r|
Show InChI InChI=1S/C13H17N5O5/c1-2-7(19)22-3-6-9(20)10(21)13(23-6)18-5-17-8-11(14)15-4-16-12(8)18/h4-6,9-10,13,20-21H,2-3H2,1H3,(H2,14,15,16)/t6-,9-,10-,13-/m1/s1
Reactome pathway
387n/an/an/an/an/an/an/an/a
Warner-Lambert/Parke-Davis Pharmaceutical Research
Curated by PDSP Ki Database
Mol Pharmacol 29: 331-46 (1986)
BindingDB Entry DOI: 10.7270/Q2MK6BDV
Sodium/nucleoside cotransporter 2
(Homo sapiens (Human))
BDBM82052
(Ado-5'-ethylcarboxylate)
Show SMILES CCC(=O)OC[C@H]1O[C@H]([C@H](O)[C@@H]1O)n1cnc2c(N)ncnc12 |r|
Show InChI InChI=1S/C13H17N5O5/c1-2-7(19)22-3-6-9(20)10(21)13(23-6)18-5-17-8-11(14)15-4-16-12(8)18/h4-6,9-10,13,20-21H,2-3H2,1H3,(H2,14,15,16)/t6-,9-,10-,13-/m1/s1
Reactome pathway
n/an/a>1.00E+5n/an/an/an/an/an/a
Kissei Pharmaceutical Co., Ltd.
Curated by ChEMBL
Assay Description
Inhibition of human CNT2 expressed in COS7 cells assessed as reduction in sodium-dependent [14C]-inosine uptake in presence of Na+ by liquid scintill...
ACS Med Chem Lett 6: 244-8 (2015)
Article DOI: 10.1021/ml500343r
BindingDB Entry DOI: 10.7270/Q2BK1F27