BDBM83547 (E)-2-(4-cyclopropyl-1,3-thiazol-2-yl)-3-(4-nitrophenyl)prop-2-enenitrile::(E)-2-(4-cyclopropyl-2-thiazolyl)-3-(4-nitrophenyl)-2-propenenitrile::(E)-2-(4-cyclopropylthiazol-2-yl)-3-(4-nitrophenyl)acrylonitrile::2-(4-Cyclopropyl-thiazol-2-yl)-3-(4-nitro-phenyl)-acrylonitrile::MLS000569222::SMR000176198::cid_5720699
SMILES: [O-][N+](=O)c1ccc(\C=C(/C#N)c2nc(cs2)C2CC2)cc1
InChI Key: InChIKey=PZDYZOBOEJSNRW-KPKJPENVSA-N
Data: 2 EC50
Activity Spreadsheet -- Enzyme Inhibition Constant Data from BindingDB
Found 2 hits for monomerid = 83547
Trg + Lig
Ki
nM
ΔG°
kcal/mole
IC50
nM
Kd
nM
EC50/IC50
nM
koff
s-1
kon
M-1s-1
pHTemp
°C
mRNA interferase toxin, antitoxin is MazE
(Escherichia coli str. K-12 substr. MG1655)
BDBM83547
((E)-2-(4-cyclopropyl-1,3-thiazol-2-yl)-3-(4-nitrop...)
Show SMILES [O-][N+](=O)c1ccc(\C=C(/C#N)c2nc(cs2)C2CC2)cc1
Show InChI InChI=1S/C15H11N3O2S/c16-8-12(15-17-14(9-21-15)11-3-4-11)7-10-1-5-13(6-2-10)18(19)20/h1-2,5-7,9,11H,3-4H2/b12-7+
PCBioAssay
n/an/an/an/a>9.90E+4n/an/an/an/a
Burnham Center for Chemical Genomics
Curated by PubChem BioAssay
Assay Description
Data Source: Sanford-Burnham Center for Chemical Genomics (SBCCG) Source Affiliation: Sanford-Burnham Medical Research Institute (SBMRI, San Diego, C...
PubChem Bioassay (2011)
BindingDB Entry DOI: 10.7270/Q2TB15DB
mRNA interferase toxin, antitoxin is MazE
(Escherichia coli str. K-12 substr. MG1655)
BDBM83547
((E)-2-(4-cyclopropyl-1,3-thiazol-2-yl)-3-(4-nitrop...)
Show SMILES [O-][N+](=O)c1ccc(\C=C(/C#N)c2nc(cs2)C2CC2)cc1
Show InChI InChI=1S/C15H11N3O2S/c16-8-12(15-17-14(9-21-15)11-3-4-11)7-10-1-5-13(6-2-10)18(19)20/h1-2,5-7,9,11H,3-4H2/b12-7+
PCBioAssay
n/an/an/an/a 1.04E+4n/an/an/an/a
Burnham Center for Chemical Genomics
Curated by PubChem BioAssay
Assay Description
Data Source: Sanford-Burnham Center for Chemical Genomics (SBCCG) Source Affiliation: Sanford-Burnham Medical Research Institute (SBMRI, San Diego, C...
PubChem Bioassay (2011)
BindingDB Entry DOI: 10.7270/Q2Z31X54