BDBM83832 2-[[2-[methyl(tosyl)amino]benzoyl]amino]-N-propyl-benzamide::2-[[2-[methyl-(4-methylphenyl)sulfonyl-amino]phenyl]carbonylamino]-N-propyl-benzamide::2-[[2-[methyl-(4-methylphenyl)sulfonylamino]benzoyl]amino]-N-propylbenzamide::2-[[[2-[methyl-(4-methylphenyl)sulfonylamino]phenyl]-oxomethyl]amino]-N-propylbenzamide::2-{methyl[(4-methylphenyl)sulfonyl]amino}-N-{2-[(propylamino)carbonyl]phenyl}benzamide::MLS002546512::SMR000199732::cid_2205012
SMILES: CCCNC(=O)c1ccccc1NC(=O)c1ccccc1N(C)S(=O)(=O)c1ccc(C)cc1
InChI Key: InChIKey=UVZQNEGMGHNYBZ-UHFFFAOYSA-N
Data: 1 EC50
Activity Spreadsheet -- Enzyme Inhibition Constant Data from BindingDB
Found 1 hit for monomerid = 83832
Trg + Lig
Ki
nM
ΔG°
kcal/mole
IC50
nM
Kd
nM
EC50/IC50
nM
koff
s-1
kon
M-1s-1
pHTemp
°C
FXN frataxin
(Aspergillus niger)
BDBM83832
(2-[[2-[methyl(tosyl)amino]benzoyl]amino]-N-propyl-...)
Show SMILES CCCNC(=O)c1ccccc1NC(=O)c1ccccc1N(C)S(=O)(=O)c1ccc(C)cc1
Show InChI InChI=1S/C25H27N3O4S/c1-4-17-26-24(29)20-9-5-7-11-22(20)27-25(30)21-10-6-8-12-23(21)28(3)33(31,32)19-15-13-18(2)14-16-19/h5-16H,4,17H2,1-3H3,(H,26,29)(H,27,30)
PCBioAssay
n/an/an/an/a>5.96E+4n/an/an/an/a
The Scripps Research Institute Molecular Screening Center
Curated by PubChem BioAssay
Assay Description
Source (MLPCN Center Name): The Scripps Research Institute Molecular Screening Center (SRISMC) Center Affiliation: The Scripps Research Institute, TS...
PubChem Bioassay (2011)
BindingDB Entry DOI: 10.7270/Q2PK0DN5