null
SMILES: CN(C)CCNC(=O)c1ccc(Cl)c2cc3ccccc3nc12
InChI Key: InChIKey=JTASMCJGKOJUIT-UHFFFAOYSA-N
Activity Spreadsheet -- Enzyme Inhibition Constant Data from BindingDB
Found 1 hit for monomerid = 83847
Trg + Lig
Ki
nM
ΔG°
kcal/mole
IC50
nM
Kd
nM
EC50/IC50
nM
koff
s-1
kon
M-1s-1
pHTemp
°C
Orotidine 5'-phosphate decarboxylase
(Aspergillus niger)
BDBM83847
(1-chloranyl-N-[2-(dimethylamino)ethyl]acridine-4-c...)
Show SMILES CN(C)CCNC(=O)c1ccc(Cl)c2cc3ccccc3nc12
Show InChI InChI=1S/C18H18ClN3O/c1-22(2)10-9-20-18(23)13-7-8-15(19)14-11-12-5-3-4-6-16(12)21-17(13)14/h3-8,11H,9-10H2,1-2H3,(H,20,23)
PCBioAssay
n/an/an/an/a>2.21E+3n/an/an/an/a
The Scripps Research Institute Molecular Screening Center
Curated by PubChem BioAssay
Assay Description
Source (MLPCN Center Name): The Scripps Research Institute Molecular Screening Center (SRISMC) Center Affiliation: The Scripps Research Institute, TS...
PubChem Bioassay (2011)
BindingDB Entry DOI: 10.7270/Q2PK0DN5