BDBM84134 (2R,3R,4S)-4-(4-bromophenyl)-2-ethoxy-3-(3-hydroxypropyl)-N-phenyl-3,4-dihydro-2H-pyran-6-carboxamide::(2R,3R,4S)-4-(4-bromophenyl)-2-ethoxy-3-(3-oxidanylpropyl)-N-phenyl-3,4-dihydro-2H-pyran-6-carboxamide::MLS000766547::SMR000441974::cid_16197076
SMILES: CCO[C@@H]1OC(=C[C@@H]([C@H]1CCCO)c1ccc(Br)cc1)C(=O)Nc1ccccc1
InChI Key: InChIKey=BFJMLSQDUXDYEI-TXTKFYIRSA-N
Data: 2 EC50
Activity Spreadsheet -- Enzyme Inhibition Constant Data from BindingDB
Found 2 hits for monomerid = 84134
Trg + Lig
Ki
nM
ΔG°
kcal/mole
IC50
nM
Kd
nM
EC50/IC50
nM
koff
s-1
kon
M-1s-1
pHTemp
°C
Candida albicans strain ATCC 10261 multidrug efflux pump (MDR1) gene, MDR1-A allele, complete cds
(Candida albicans)
BDBM84134
((2R,3R,4S)-4-(4-bromophenyl)-2-ethoxy-3-(3-hydroxy...)
Show SMILES CCO[C@@H]1OC(=C[C@@H]([C@H]1CCCO)c1ccc(Br)cc1)C(=O)Nc1ccccc1 |c:5|
Show InChI InChI=1S/C23H26BrNO4/c1-2-28-23-19(9-6-14-26)20(16-10-12-17(24)13-11-16)15-21(29-23)22(27)25-18-7-4-3-5-8-18/h3-5,7-8,10-13,15,19-20,23,26H,2,6,9,14H2,1H3,(H,25,27)/t19-,20-,23-/m1/s1
PCBioAssay
n/an/an/an/a 2.52E+4n/an/an/an/a
NMMLSC
Curated by PubChem BioAssay
Assay Description
UNMCMD Assay Overview: Assay Support: 1 R03 MH087406-01A1 Project Title: Identification of broad-spectrum antifungal efflux pump inhibitors ...
PubChem Bioassay (2012)
BindingDB Entry DOI: 10.7270/Q2765CXD
drug resistance protein 1
(Candida albicans)
BDBM84134
((2R,3R,4S)-4-(4-bromophenyl)-2-ethoxy-3-(3-hydroxy...)
Show SMILES CCO[C@@H]1OC(=C[C@@H]([C@H]1CCCO)c1ccc(Br)cc1)C(=O)Nc1ccccc1 |c:5|
Show InChI InChI=1S/C23H26BrNO4/c1-2-28-23-19(9-6-14-26)20(16-10-12-17(24)13-11-16)15-21(29-23)22(27)25-18-7-4-3-5-8-18/h3-5,7-8,10-13,15,19-20,23,26H,2,6,9,14H2,1H3,(H,25,27)/t19-,20-,23-/m1/s1
PCBioAssay
n/an/an/an/a 1.17E+4n/an/an/an/a
NMMLSC
Curated by PubChem BioAssay
Assay Description
UNMCMD Assay Overview: Assay Support: 1 R03 MH087406-01A1 Project Title: Identification of broad-spectrum antifungal efflux pump inhibitors ...
PubChem Bioassay (2011)
BindingDB Entry DOI: 10.7270/Q24M932M