BDBM8414 (5Z)-3-(4-methoxyphenyl)-2-sulfanylidene-5-({5-[3-(trifluoromethyl)phenyl]furan-2-yl}methylidene)-1,3-thiazolidin-4-one::Rhodanine-furan analogue 1
SMILES: COc1ccc(cc1)N1C(=S)S\C(=C/c2ccc(o2)-c2cccc(c2)C(F)(F)F)C1=O
InChI Key: InChIKey=LAEQOMVPHKEMBO-UNOMPAQXSA-N
Data: 1 IC50
Activity Spreadsheet -- Enzyme Inhibition Constant Data from BindingDB
Found 1 hit for monomerid = 8414
Trg + Lig
Ki
nM
ΔG°
kcal/mole
IC50
nM
Kd
nM
EC50/IC50
nM
koff
s-1
kon
M-1s-1
pHTemp
°C
Anthrax Lethal Factor (LF)
(Bacillus anthracis)
BDBM8414
((5Z)-3-(4-methoxyphenyl)-2-sulfanylidene-5-({5-[3-...)
Show SMILES COc1ccc(cc1)N1C(=S)S\C(=C/c2ccc(o2)-c2cccc(c2)C(F)(F)F)C1=O
Show InChI InChI=1S/C22H14F3NO3S2/c1-28-16-7-5-15(6-8-16)26-20(27)19(31-21(26)30)12-17-9-10-18(29-17)13-3-2-4-14(11-13)22(23,24)25/h2-12H,1H3/b19-12-
NCI pathway
Reactome pathway
n/an/a 3.00E+5n/an/an/an/a7.422
Burnham Institute for Medical Research
Assay Description
Fluorescence peptide cleavage assay was performed in a 96-well plate. Each reaction contained MAPKKide, LF, and the small-molecule inhibitor. The C-t...
Proc Natl Acad Sci U S A 102: 9499-504 (2005)
Article DOI: 10.1073/pnas.0502733102
BindingDB Entry DOI: 10.7270/Q2TM78BQ