BDBM8415 (5Z)-5-{[5-(4-chlorophenyl)furan-2-yl]methylidene}-3-(furan-2-ylmethyl)-2-sulfanylidene-1,3-thiazolidin-4-one::Rhodanine-furan analogue 2
SMILES: Clc1ccc(cc1)-c1ccc(\C=C2/SC(=S)N(Cc3ccco3)C2=O)o1
InChI Key: InChIKey=FAVIEKHNXCLRPT-YVLHZVERSA-N
Data: 1 IC50
Activity Spreadsheet -- Enzyme Inhibition Constant Data from BindingDB
Found 1 hit for monomerid = 8415
Trg + Lig
Ki
nM
ΔG°
kcal/mole
IC50
nM
Kd
nM
EC50/IC50
nM
koff
s-1
kon
M-1s-1
pHTemp
°C
Anthrax Lethal Factor (LF)
(Bacillus anthracis)
BDBM8415
((5Z)-5-{[5-(4-chlorophenyl)furan-2-yl]methylidene}...)
Show SMILES Clc1ccc(cc1)-c1ccc(\C=C2/SC(=S)N(Cc3ccco3)C2=O)o1
Show InChI InChI=1S/C19H12ClNO3S2/c20-13-5-3-12(4-6-13)16-8-7-14(24-16)10-17-18(22)21(19(25)26-17)11-15-2-1-9-23-15/h1-10H,11H2/b17-10-
NCI pathway
Reactome pathway
n/an/a 1.50E+5n/an/an/an/a7.422
Burnham Institute for Medical Research
Assay Description
Fluorescence peptide cleavage assay was performed in a 96-well plate. Each reaction contained MAPKKide, LF, and the small-molecule inhibitor. The C-t...
Proc Natl Acad Sci U S A 102: 9499-504 (2005)
Article DOI: 10.1073/pnas.0502733102
BindingDB Entry DOI: 10.7270/Q2TM78BQ