null
SMILES: CCC(C(=O)Nc1ccccc1-c1ccccc1)c1ccccc1
InChI Key: InChIKey=PCILUKREGGQUCG-UHFFFAOYSA-N
Activity Spreadsheet -- Enzyme Inhibition Constant Data from BindingDB
Found 2 hits for monomerid = 84166
Trg + Lig
Ki
nM
ΔG°
kcal/mole
IC50
nM
Kd
nM
EC50/IC50
nM
koff
s-1
kon
M-1s-1
pHTemp
°C
Potassium voltage-gated channel subfamily KQT member 2
(Homo sapiens (Human))
BDBM84166
(2-phenyl-N-(2-phenylphenyl)butanamide | 2-phenyl-N...)
Show SMILES CCC(C(=O)Nc1ccccc1-c1ccccc1)c1ccccc1
Show InChI InChI=1S/C22H21NO/c1-2-19(17-11-5-3-6-12-17)22(24)23-21-16-10-9-15-20(21)18-13-7-4-8-14-18/h3-16,19H,2H2,1H3,(H,23,24)
Reactome pathway
n/an/a 1.32E+3n/an/an/an/an/an/a
Vanderbilt University Medical Center
Curated by ChEMBL
Assay Description
Antagonist activity at KCNQ2 expressed in CHO cells incubated for 3 mins by automated patch clamp assay
J Med Chem 55: 6975-9 (2012)
Article DOI: 10.1021/jm300700v
BindingDB Entry DOI: 10.7270/Q2KD2017
Potassium voltage-gated channel subfamily KQT member 2
(Rattus norvegicus)
BDBM84166
(2-phenyl-N-(2-phenylphenyl)butanamide | 2-phenyl-N...)
Show SMILES CCC(C(=O)Nc1ccccc1-c1ccccc1)c1ccccc1
Show InChI InChI=1S/C22H21NO/c1-2-19(17-11-5-3-6-12-17)22(24)23-21-16-10-9-15-20(21)18-13-7-4-8-14-18/h3-16,19H,2H2,1H3,(H,23,24)
Reactome pathway
PCBioAssay
n/an/a 3.11E+3n/an/an/an/an/an/a
Johns Hopkins Ion Channel Center
Curated by PubChem BioAssay
Assay Description
Source (MLPCN Center Name): Johns Hopkins Ion Channel Center (JHICC_KCNQ2_Inh_HFCP_IWS_CRC) Center Affiliation: Johns Hopkins University, School of M...
PubChem Bioassay (2011)
BindingDB Entry DOI: 10.7270/Q2W37TT2