BDBM84297 1-(4-bromophenyl)-2-(2-imino-3-methyl-1-benzimidazolyl)ethanone;hydrobromide::1-(4-bromophenyl)-2-(2-imino-3-methyl-2,3-dihydro-1H-benzimidazol-1-yl)ethanone::1-(4-bromophenyl)-2-(2-imino-3-methyl-benzimidazol-1-yl)ethanone;hydrobromide::1-(4-bromophenyl)-2-(2-imino-3-methylbenzimidazol-1-yl)ethanone;hydrobromide::2-(2-azanylidene-3-methyl-benzimidazol-1-yl)-1-(4-bromophenyl)ethanone;hydrobromide::CHEMBL255837::MLS001179161::SMR000476138::cid_2851497
SMILES: Cn1c2ccccc2n(CC(=O)c2ccc(Br)cc2)c1=N
InChI Key: InChIKey=PUVXHJNHJICBBO-UHFFFAOYSA-N
Data: 1 IC50  3 EC50
Activity Spreadsheet -- Enzyme Inhibition Constant Data from BindingDB
Found 4 hits for monomerid = 84297
Trg + Lig
Ki
nM
ΔG°
kcal/mole
IC50
nM
Kd
nM
EC50/IC50
nM
koff
s-1
kon
M-1s-1
pHTemp
°C
LARGE
(Homo sapiens (Human))
BDBM84297
(1-(4-bromophenyl)-2-(2-imino-3-methyl-1-benzimidaz...)
Show SMILES Cn1c2ccccc2n(CC(=O)c2ccc(Br)cc2)c1=N
Show InChI InChI=1S/C16H14BrN3O/c1-19-13-4-2-3-5-14(13)20(16(19)18)10-15(21)11-6-8-12(17)9-7-11/h2-9,18H,10H2,1H3
PCBioAssay
n/an/an/an/a 4.27E+4n/an/an/an/a
Burnham Center for Chemical Genomics
Curated by PubChem BioAssay
PubChem Bioassay (2012)
BindingDB Entry DOI: 10.7270/Q2VT1QQ4
chemokine (C-X-C motif) receptor 3
(Homo sapiens (Human))
BDBM84297
(1-(4-bromophenyl)-2-(2-imino-3-methyl-1-benzimidaz...)
Show SMILES Cn1c2ccccc2n(CC(=O)c2ccc(Br)cc2)c1=N
Show InChI InChI=1S/C16H14BrN3O/c1-19-13-4-2-3-5-14(13)20(16(19)18)10-15(21)11-6-8-12(17)9-7-11/h2-9,18H,10H2,1H3
n/an/a 800n/an/an/an/an/an/a
Abbott Bioresearch Center
Curated by ChEMBL
Assay Description
Displacement of [125]CXCL10 from human CXCR3 expressed in CHO cells
Bioorg Med Chem Lett 18: 1573-6 (2008)
Article DOI: 10.1016/j.bmcl.2008.01.074
BindingDB Entry DOI: 10.7270/Q2QZ2BTF
Protein DAF-12, isoform a
(Caenorhabditis elegans)
BDBM84297
(1-(4-bromophenyl)-2-(2-imino-3-methyl-1-benzimidaz...)
Show SMILES Cn1c2ccccc2n(CC(=O)c2ccc(Br)cc2)c1=N
Show InChI InChI=1S/C16H14BrN3O/c1-19-13-4-2-3-5-14(13)20(16(19)18)10-15(21)11-6-8-12(17)9-7-11/h2-9,18H,10H2,1H3
PCBioAssay
n/an/an/an/a 6.75E+4n/an/an/an/a
The Scripps Research Institute Molecular Screening Center
Curated by PubChem BioAssay
Assay Description
Source (MLPCN Center Name): The Scripps Research Institute Molecular Screening Center (SRIMSC) Affiliation: The Scripps Research Institute, TSRI Assa...
PubChem Bioassay (2013)
BindingDB Entry DOI: 10.7270/Q2BV7F8Z
Oxysterols receptor LXR-beta
(Homo sapiens (Human))
BDBM84297
(1-(4-bromophenyl)-2-(2-imino-3-methyl-1-benzimidaz...)
Show SMILES Cn1c2ccccc2n(CC(=O)c2ccc(Br)cc2)c1=N
Show InChI InChI=1S/C16H14BrN3O/c1-19-13-4-2-3-5-14(13)20(16(19)18)10-15(21)11-6-8-12(17)9-7-11/h2-9,18H,10H2,1H3
PCBioAssay
n/an/an/an/a 6.75E+4n/an/an/an/a
The Scripps Research Institute Molecular Screening Center
Curated by PubChem BioAssay
Assay Description
Source (MLPCN Center Name): The Scripps Research Institute Molecular Screening Center Affiliation: UT Southwestern Assay Provider: David Mangelsdorf,...
PubChem Bioassay (2013)
BindingDB Entry DOI: 10.7270/Q23F4N80