BDBM8435 3-[(5Z)-5-{[5-(4-chlorophenyl)furan-2-yl]methylidene}-4-oxo-2-sulfanylidene-1,3-thiazolidin-3-yl]propanoic acid::BI-MFM3::Rhodanine analogue
SMILES: OC(=O)CCN1C(=S)S\C(=C/c2ccc(o2)-c2ccc(Cl)cc2)C1=O
InChI Key: InChIKey=YZLFZFALAZYTCI-ZROIWOOFSA-N
Data: 1 KI  1 IC50
PDB links: 1 PDB ID matches this monomer.
Activity Spreadsheet -- Enzyme Inhibition Constant Data from BindingDB
Found 1 hit for monomerid = 8435
Trg + Lig
Ki
nM
ΔG°
kcal/mole
IC50
nM
Kd
nM
EC50/IC50
nM
koff
s-1
kon
M-1s-1
pHTemp
°C
Anthrax Lethal Factor (LF)
(Bacillus anthracis)
BDBM8435
(3-[(5Z)-5-{[5-(4-chlorophenyl)furan-2-yl]methylide...)
Show SMILES OC(=O)CCN1C(=S)S\C(=C/c2ccc(o2)-c2ccc(Cl)cc2)C1=O
Show InChI InChI=1S/C17H12ClNO4S2/c18-11-3-1-10(2-4-11)13-6-5-12(23-13)9-14-16(22)19(17(24)25-14)8-7-15(20)21/h1-6,9H,7-8H2,(H,20,21)/b14-9-
NCI pathway
Reactome pathway
800n/a 1.70E+3n/an/an/an/an/an/a
Burnham Institute for Medical Research
Assay Description
Fluorescence peptide cleavage assay was performed in a 96-well plate. Each reaction contained MAPKKide, LF, and the small-molecule inhibitor. The C-t...
Proc Natl Acad Sci U S A 102: 9499-504 (2005)
Article DOI: 10.1073/pnas.0502733102
BindingDB Entry DOI: 10.7270/Q2TM78BQ
3D
3D Structure (crystal)