BDBM8436 2-[(5Z)-5-(furan-2-ylmethylidene)-4-oxo-2-sulfanylidene-1,3-thiazolidin-3-yl]acetic acid::BI-9B9b::Rhodanine analogue
SMILES: OC(=O)CN1C(=S)S\C(=C/c2ccco2)C1=O
InChI Key: InChIKey=DFCZJGAFQKNSEX-DAXSKMNVSA-N
Data: 2 IC50
Activity Spreadsheet -- Enzyme Inhibition Constant Data from BindingDB
Found 2 hits for monomerid = 8436
Trg + Lig
Ki
nM
ΔG°
kcal/mole
IC50
nM
Kd
nM
EC50/IC50
nM
koff
s-1
kon
M-1s-1
pHTemp
°C
Mitogen-activated protein kinase kinase kinase 5
(Homo sapiens (Human))
BDBM8436
(2-[(5Z)-5-(furan-2-ylmethylidene)-4-oxo-2-sulfanyl...)
Show SMILES OC(=O)CN1C(=S)S\C(=C/c2ccco2)C1=O
Show InChI InChI=1S/C10H7NO4S2/c12-8(13)5-11-9(14)7(17-10(11)16)4-6-2-1-3-15-6/h1-4H,5H2,(H,12,13)/b7-4-
n/an/a>3.30E+4n/an/an/an/an/an/a
NAS of Ukraine
Curated by ChEMBL
Assay Description
Inhibition of human ASK1 using MBP as substrate incubated for 10 mins prior to ATP addition measured after 20 mins by liquid scintillation counting a...
Eur J Med Chem 61: 104-15 (2013)
Article DOI: 10.1016/j.ejmech.2012.09.022
BindingDB Entry DOI: 10.7270/Q2FX7BTH
Anthrax Lethal Factor (LF)
(Bacillus anthracis)
BDBM8436
(2-[(5Z)-5-(furan-2-ylmethylidene)-4-oxo-2-sulfanyl...)
Show SMILES OC(=O)CN1C(=S)S\C(=C/c2ccco2)C1=O
Show InChI InChI=1S/C10H7NO4S2/c12-8(13)5-11-9(14)7(17-10(11)16)4-6-2-1-3-15-6/h1-4H,5H2,(H,12,13)/b7-4-
NCI pathway
Reactome pathway
n/an/a 1.40E+5n/an/an/an/an/an/a
Burnham Institute for Medical Research
Assay Description
Fluorescence peptide cleavage assay was performed in a 96-well plate. Each reaction contained MAPKKide, LF, and the small-molecule inhibitor. The C-t...
Proc Natl Acad Sci U S A 102: 9499-504 (2005)
Article DOI: 10.1073/pnas.0502733102
BindingDB Entry DOI: 10.7270/Q2TM78BQ