BDBM8445 2-[(5Z)-4-oxo-2-sulfanylidene-5-(thiophen-2-ylmethylidene)-1,3-thiazolidin-3-yl]acetic acid::Rhodanine-thiophene analogue 10
SMILES: OC(=O)CN1C(=S)S\C(=C/c2cccs2)C1=O
InChI Key: InChIKey=CEIMGRLZNNVXBO-DAXSKMNVSA-N
Data: 1 IC50
Activity Spreadsheet -- Enzyme Inhibition Constant Data from BindingDB
Found 1 hit for monomerid = 8445
Trg + Lig
Ki
nM
ΔG°
kcal/mole
IC50
nM
Kd
nM
EC50/IC50
nM
koff
s-1
kon
M-1s-1
pHTemp
°C
Anthrax Lethal Factor (LF)
(Bacillus anthracis)
BDBM8445
(2-[(5Z)-4-oxo-2-sulfanylidene-5-(thiophen-2-ylmeth...)
Show SMILES OC(=O)CN1C(=S)S\C(=C/c2cccs2)C1=O
Show InChI InChI=1S/C10H7NO3S3/c12-8(13)5-11-9(14)7(17-10(11)15)4-6-2-1-3-16-6/h1-4H,5H2,(H,12,13)/b7-4-
NCI pathway
Reactome pathway
n/an/a 7.94E+4n/an/an/an/an/an/a
Burnham Institute for Medical Research
Assay Description
Fluorescence peptide cleavage assay was performed in a 96-well plate. Each reaction contained MAPKKide, LF, and the small-molecule inhibitor. The C-t...
Proc Natl Acad Sci U S A 102: 9499-504 (2005)
Article DOI: 10.1073/pnas.0502733102
BindingDB Entry DOI: 10.7270/Q2TM78BQ