BDBM8446 2-[(5Z)-5-{[5-(4-chlorophenyl)thiophen-2-yl]methylidene}-4-oxo-2-sulfanylidene-1,3-thiazolidin-3-yl]acetic acid::Rhodanine-thiophene analogue 11
SMILES: OC(=O)CN1C(=S)S\C(=C/c2ccc(s2)-c2ccc(Cl)cc2)C1=O
InChI Key: InChIKey=OVYXWODXMYIPOL-QPEQYQDCSA-N
Data: 1 IC50
Activity Spreadsheet -- Enzyme Inhibition Constant Data from BindingDB
Found 1 hit for monomerid = 8446
Trg + Lig
Ki
nM
ΔG°
kcal/mole
IC50
nM
Kd
nM
EC50/IC50
nM
koff
s-1
kon
M-1s-1
pHTemp
°C
Anthrax Lethal Factor (LF)
(Bacillus anthracis)
BDBM8446
(2-[(5Z)-5-{[5-(4-chlorophenyl)thiophen-2-yl]methyl...)
Show SMILES OC(=O)CN1C(=S)S\C(=C/c2ccc(s2)-c2ccc(Cl)cc2)C1=O
Show InChI InChI=1S/C16H10ClNO3S3/c17-10-3-1-9(2-4-10)12-6-5-11(23-12)7-13-15(21)18(8-14(19)20)16(22)24-13/h1-7H,8H2,(H,19,20)/b13-7-
NCI pathway
Reactome pathway
n/an/a 3.20E+3n/an/an/an/an/an/a
Burnham Institute for Medical Research
Assay Description
Fluorescence peptide cleavage assay was performed in a 96-well plate. Each reaction contained MAPKKide, LF, and the small-molecule inhibitor. The C-t...
Proc Natl Acad Sci U S A 102: 9499-504 (2005)
Article DOI: 10.1073/pnas.0502733102
BindingDB Entry DOI: 10.7270/Q2TM78BQ