BDBM84563 Linked sulfated tetracyclitol, 4
SMILES: [O-]S(=O)(=O)O[C@@H]1C=C[C@@H]([C@@H](OS([O-])(=O)=O)[C@@H]1OS([O-])(=O)=O)N(CCCCN([C@H]1C=C[C@@H](OS([O-])(=O)=O)[C@@H](OS([O-])(=O)=O)[C@@H]1OS([O-])(=O)=O)[C@H]1C=C[C@@H](OS([O-])(=O)=O)[C@@H](OS([O-])(=O)=O)[C@@H]1OS([O-])(=O)=O)[C@H]1C=C[C@@H](OS([O-])(=O)=O)[C@@H](OS([O-])(=O)=O)[C@@H]1OS([O-])(=O)=O
InChI Key: InChIKey=IWVJVYLXMYUCCG-QCMOYRORSA-B
Data: 2 Kd
Activity Spreadsheet -- Enzyme Inhibition Constant Data from BindingDB
Found 2 hits for monomerid = 84563
Trg + Lig
Ki
nM
ΔG°
kcal/mole
IC50
nM
Kd
nM
EC50/IC50
nM
koff
s-1
kon
M-1s-1
pHTemp
°C
Fibroblast growth factor 2
(Homo sapiens (Human))
BDBM84563
(Linked sulfated tetracyclitol, 4)
Show SMILES [O-]S(=O)(=O)O[C@@H]1C=C[C@@H]([C@@H](OS([O-])(=O)=O)[C@@H]1OS([O-])(=O)=O)N(CCCCN([C@H]1C=C[C@@H](OS([O-])(=O)=O)[C@@H](OS([O-])(=O)=O)[C@@H]1OS([O-])(=O)=O)[C@H]1C=C[C@@H](OS([O-])(=O)=O)[C@@H](OS([O-])(=O)=O)[C@@H]1OS([O-])(=O)=O)[C@H]1C=C[C@@H](OS([O-])(=O)=O)[C@@H](OS([O-])(=O)=O)[C@@H]1OS([O-])(=O)=O |r,c:6,29,51,73|
Show InChI InChI=1S/C28H44N2O48S12/c31-79(32,33)67-17-7-3-13(21(71-83(43,44)45)25(17)75-87(55,56)57)29(14-4-8-18(68-80(34,35)36)26(76-88(58,59)60)22(14)72-84(46,47)48)11-1-2-12-30(15-5-9-19(69-81(37,38)39)27(77-89(61,62)63)23(15)73-85(49,50)51)16-6-10-20(70-82(40,41)42)28(78-90(64,65)66)24(16)74-86(52,53)54/h3-10,13-28H,1-2,11-12H2,(H,31,32,33)(H,34,35,36)(H,37,38,39)(H,40,41,42)(H,43,44,45)(H,46,47,48)(H,49,50,51)(H,52,53,54)(H,55,56,57)(H,58,59,60)(H,61,62,63)(H,64,65,66)/p-12/t13-,14-,15-,16-,17+,18+,19+,20+,21+,22+,23+,24+,25+,26+,27+,28+/m0/s1
Reactome pathway
n/an/an/a 161n/an/an/a7.4n/a
Progen Industries Ltd.
Assay Description
Human FGF-1 and FGF-2 were purchased from R&D Systems, Inc. and supplied as protein (ug) dissolved in bovine serum albumin (BSA, 50ug). Surface plas...
Chembiochem 6: 1882-90 (2005)
Checked by Author
Article DOI: 10.1002/cbic.200500089
BindingDB Entry DOI: 10.7270/Q22N50S0
Acidic fibroblast growth factor
(Homo sapiens (Human))
BDBM84563
(Linked sulfated tetracyclitol, 4)
Show SMILES [O-]S(=O)(=O)O[C@@H]1C=C[C@@H]([C@@H](OS([O-])(=O)=O)[C@@H]1OS([O-])(=O)=O)N(CCCCN([C@H]1C=C[C@@H](OS([O-])(=O)=O)[C@@H](OS([O-])(=O)=O)[C@@H]1OS([O-])(=O)=O)[C@H]1C=C[C@@H](OS([O-])(=O)=O)[C@@H](OS([O-])(=O)=O)[C@@H]1OS([O-])(=O)=O)[C@H]1C=C[C@@H](OS([O-])(=O)=O)[C@@H](OS([O-])(=O)=O)[C@@H]1OS([O-])(=O)=O |r,c:6,29,51,73|
Show InChI InChI=1S/C28H44N2O48S12/c31-79(32,33)67-17-7-3-13(21(71-83(43,44)45)25(17)75-87(55,56)57)29(14-4-8-18(68-80(34,35)36)26(76-88(58,59)60)22(14)72-84(46,47)48)11-1-2-12-30(15-5-9-19(69-81(37,38)39)27(77-89(61,62)63)23(15)73-85(49,50)51)16-6-10-20(70-82(40,41)42)28(78-90(64,65)66)24(16)74-86(52,53)54/h3-10,13-28H,1-2,11-12H2,(H,31,32,33)(H,34,35,36)(H,37,38,39)(H,40,41,42)(H,43,44,45)(H,46,47,48)(H,49,50,51)(H,52,53,54)(H,55,56,57)(H,58,59,60)(H,61,62,63)(H,64,65,66)/p-12/t13-,14-,15-,16-,17+,18+,19+,20+,21+,22+,23+,24+,25+,26+,27+,28+/m0/s1
Reactome pathway
n/an/an/a 25.4n/an/an/a7.4n/a
Progen Industries Ltd.
Assay Description
Human FGF-1 and FGF-2 were purchased from R&D Systems, Inc. and supplied as protein (ug) dissolved in bovine serum albumin (BSA, 50ug). Surface plas...
Chembiochem 6: 1882-90 (2005)
Checked by Author
Article DOI: 10.1002/cbic.200500089
BindingDB Entry DOI: 10.7270/Q22N50S0