BDBM847 (2R,3R,4R,5R)-3,4-dihydroxy-N,N'-bis[(1S)-2-methyl-1-(methylcarbamoyl)propyl]-2,5-bis({[4-(3-nitrophenyl)phenyl]methoxy})hexanediamide::C2-Symmetric inhibitor 5::N1,N6-Bis[(1S)-2-methyl-1-(methylcarbamoyl)propyl]-(2R,3R,4R,5R)-2,5-bis[4-(3-nitrophenyl)benzyloxy]-3,4-dihydroxyhexanediamide
SMILES: CNC(=O)[C@@H](NC(=O)[C@H](OCc1ccc(cc1)-c1cccc(c1)N(=O)=O)[C@H](O)[C@@H](O)[C@@H](OCc1ccc(cc1)-c1cccc(c1)N(=O)=O)C(=O)N[C@@H](C(C)C)C(=O)NC)C(C)C
InChI Key: InChIKey=GNZIXCJETYMUQA-OYEZVYLDSA-N
Data: 1 KI
Activity Spreadsheet -- Enzyme Inhibition Constant Data from BindingDB
Found 1 hit for monomerid = 847
Trg + Lig
Ki
nM
ΔG°
kcal/mole
IC50
nM
Kd
nM
EC50/IC50
nM
koff
s-1
kon
M-1s-1
pHTemp
°C
HIV-1 Protease
(Human immunodeficiency virus type 1)
BDBM847
((2R,3R,4R,5R)-3,4-dihydroxy-N,N'-bis[(1S)-2-methyl...)
Show SMILES CNC(=O)[C@@H](NC(=O)[C@H](OCc1ccc(cc1)-c1cccc(c1)N(=O)=O)[C@H](O)[C@@H](O)[C@@H](OCc1ccc(cc1)-c1cccc(c1)N(=O)=O)C(=O)N[C@@H](C(C)C)C(=O)NC)C(C)C |r|
Show InChI InChI=1S/C44H52N6O12/c1-25(2)35(41(53)45-5)47-43(55)39(61-23-27-13-17-29(18-14-27)31-9-7-11-33(21-31)49(57)58)37(51)38(52)40(44(56)48-36(26(3)4)42(54)46-6)62-24-28-15-19-30(20-16-28)32-10-8-12-34(22-32)50(59)60/h7-22,25-26,35-40,51-52H,23-24H2,1-6H3,(H,45,53)(H,46,54)(H,47,55)(H,48,56)/t35-,36-,37+,38+,39+,40+/m0/s1
1.40 -12.3n/an/an/an/an/a5.030
Uppsala University
Assay Description
Ki values were determined by using a fluorescent substrate (DABCYL-gamma-Abu-Ser-Gln-Asn-Tyr-Pro-Ile-Val-Gln-EDANS). All incubations were performed a...
J Med Chem 42: 3835-44 (1999)
Article DOI: 10.1021/jm9910371
BindingDB Entry DOI: 10.7270/Q2T151VX